{"text_format":"1","workbook":"xlsx","n_sheets":43,"sheets":["SysLists","CheckList","Introduction","Instructions","Methods&Limits","Contacts&Annual Summary","FQMS&Sampling","Detailed FQMS","Sales","Regional Petrol Sampling (S)","Regional Petrol Sampling (W)","Regional Diesel Sampling (S)","Regional Diesel Sampling (W)","Petrol (1)","Petrol (2)","Petrol (1+2)","Petrol (3)","Petrol (4)","Petrol (3+4)","Petrol (5)","Petrol (6)","Petrol (5+6)","Petrol (7)","Petrol (8)","Petrol (7+8)","Petrol (9)","Petrol (10)","Petrol (9+10)","Diesel (1)","Diesel (2)","Diesel (1+2)","Diesel (3)","Diesel (4)","Diesel (3+4)","Diesel (5)","Diesel (6)","Diesel (5+6)","Diesel (7)","Diesel (8)","Diesel (7+8)","Diesel (9)","Diesel (10)","Diesel (9+10)"],"not_rendered":{"charts":0,"images":0,"macros":1,"external_links":0,"defined_names":79,"comments":0,"pivot_tables":0},"unopened":[],"bounds":{"document_bytes":16777216,"sheet_cells":100000,"rows_first":2000,"rows_last":500,"rows_between":2000,"halvings":0,"cell_chars":16384,"cell_head_chars":4096},"cells_cut":0,"cells_raw":0,"read":"whole","date_system":"1900"}

{"sheet":"SysLists","index":0,"n_rows":28,"n_cols":12,"rows_kept":28,"cut":false,"hidden":true,"merged":[]}
["Reporting Year",null,"Order","Countries","CountryCode","SummerPeriod","SummerCode",null,"Key","Model","Size","Samples"]
[2013,null,1,"Austria","A","1st May to 30th September","N",null,{"$f":"J2&\"_\"&K2","v":"N_S"},"N","S","-"]
[null,null,{"$f":"C2+1","v":2},"Belgium","B","1st May to 30th September","N",null,"N_L","N","L","-"]
[null,null,3,"Denmark","DK","1st June to 31st August","A",null,"C_S","C","S",50]
[null,null,4,"Finland","FIN","1st June to 31st August","A",null,"C_L","C","L",50]
[null,null,5,"France","F","1st May to 30th September","N",null,"A_S","A","S",50]
[null,null,6,"Germany","D","1st May to 30th September","N",null,"A_L","A","L",100]
[null,null,7,"Greece","GR","1st May to 30th September","N",null,"B_S","B","S",100]
[null,null,8,"Ireland","IRE","1st June to 31st August","A",null,"B_L","B","L",200]
[null,null,9,"Italy","I","1st May to 30th September","N"]
[null,null,10,"Luxembourg","L","1st May to 30th September","N"]
[null,null,11,"Netherlands","NL","1st May to 30th September","N"]
[null,null,12,"Portugal","P","1st May to 30th September","N"]
[null,null,13,"Spain","E","1st May to 30th September","N"]
[null,null,14,"Sweden","S","1st June to 31st August","A"]
[null,null,15,"UK","UK","1st June to 31st August","A"]
[null,null,16,"Cyprus","CY","1st May to 30th September","N"]
[null,null,17,"Czech Republic","CZ","1st May to 30th September","N"]
[null,null,18,"Estonia","EE","1st May to 30th September","N"]
[null,null,19,"Hungary","HU","1st May to 30th September","N"]
[null,null,20,"Latvia","LV","1st June to 31st August","A"]
[null,null,21,"Lithuania","LT","1st May to 30th September","N"]
[null,null,22,"Malta","MT","1st May to 30th September","N"]
[null,null,23,"Poland","PL","1st May to 30th September","N"]
[null,null,24,"Slovakia","SK","1st May to 30th September","N"]
[null,null,25,"Slovenia","SI","1st May to 30th September","N"]
[null,null,26,"Bulgaria","BU","1st May to 30th September","N"]
[null,null,27,"Romania","RO","1st May to 30th September","N"]

{"sheet":"CheckList","index":1,"n_rows":512,"n_cols":23,"rows_kept":512,"cut":false,"hidden":true,"merged":[]}
[null,null,null,null,null,null,null,"Check Numerical",null,null,null,null,null,"Petrol sales","Regional Petrol"]
[null,null,"Sheet","Cell","Comment",null,null,"Sheet","Cell","Comment",null,null,null,{"$f":"pTonnes","v":0},{"$f":"'Regional Petrol Sampling (S)'!C31+'Regional Petrol Sampling (W)'!C31","v":0},{"$f":"N2-O2","v":0},{"$f":"\"Petrol (\"&S2&\")\"","v":"Petrol (1)"},{"$f":"\"Diesel (\"&S2&\")\"","v":"Diesel (1)"},1,null,null,{"$f":"Sales!A10","v":"Regular unleaded petrol (minimum RON >= 91)1"},{"$f":"IF(Sales!B10<>\"\",Sales!B10,\"\")","v":""}]
[null,1,"Contacts&Annual Summary","C9","Country not selected",null,1,"Sales","C10","Please provide a numerical value",null,null,null,"Diesel Sales","Regional Diesel",null,{"$f":"\"Petrol (\"&S3&\")\"","v":"Petrol (2)"},{"$f":"\"Diesel (\"&S3&\")\"","v":"Diesel (2)"},2,null,null,{"$f":"Sales!A11","v":"Regular unleaded petrol (minimum RON >= 91) E52"},{"$f":"IF(Sales!B11<>\"\",Sales!B11,\"\")","v":"kl"}]
[null,1,"Contacts&Annual Summary","C10","Date Report Completed not provided",null,1,"Sales","C11","Please provide a numerical value",null,null,null,{"$f":"dTonnes","v":0},{"$f":"'Regional Diesel Sampling (W)'!C31+'Regional Diesel Sampling (S)'!C31","v":0},{"$f":"N4-O4","v":0},"Petrol (1+2)","Diesel (1+2)","1+2",null,null,{"$f":"Sales!A12","v":"Regular unleaded petrol (minimum RON >= 91) E102"},{"$f":"IF(Sales!B12<>\"\",Sales!B12,\"\")","v":"op"}]
[null,1,"Contacts&Annual Summary","C11","Organisation Responsible for Report not provided",null,1,"Sales","C12","Please provide a numerical value",null,null,null,null,null,null,"Petrol (3)","Diesel (3)",3,null,null,{"$f":"Sales!A13","v":"Regular unleaded petrol (minimum RON >= 91) E+2"},{"$f":"IF(Sales!B13<>\"\",Sales!B13,\"\")","v":0}]
[null,1,"Contacts&Annual Summary","C12","Address of Organisation Street not provided",null,1,"Sales","C13","Please provide a numerical value",null,null,null,"Regular unleaded petrol (minimum RON = 91)",null,null,"Petrol (4)","Diesel (4)",4,null,null,{"$f":"Sales!A14","v":"Unleaded petrol (minimum RON >= 95)1"},{"$f":"IF(Sales!B14<>\"\",Sales!B14,\"\")","v":""}]
[null,1,"Contacts&Annual Summary","C13","City not provided",null,1,"Sales","C14","Please provide a numerical value",null,null,null,"Regular unleaded petrol (minimum RON = 91) E5",null,null,"Petrol (3+4)","Diesel (3+4)","3+4",null,null,{"$f":"Sales!A15","v":"Unleaded petrol (minimum RON >= 95) E52"},{"$f":"IF(Sales!B15<>\"\",Sales!B15,\"\")","v":0}]
[null,1,"Contacts&Annual Summary","C14","Postcode not provided",null,1,"Sales","C15","Please provide a numerical value",null,null,null,"Regular unleaded petrol (minimum RON = 91) E10",null,null,"Petrol (5)","Diesel (5)",5,null,null,{"$f":"Sales!A16","v":"Unleaded petrol (minimum RON >= 95) E102"},{"$f":"IF(Sales!B16<>\"\",Sales!B16,\"\")","v":0}]
[null,1,"Contacts&Annual Summary","C15","Person Responsible for Report not provided",null,1,"Sales","C16","Please provide a numerical value",null,null,null,"Regular unleaded petrol (minimum RON = 91) E+",null,null,"Petrol (6)","Diesel (6)",6,null,null,{"$f":"Sales!A17","v":"Unleaded petrol (minimum RON >= 95) E+2"},{"$f":"IF(Sales!B17<>\"\",Sales!B17,\"\")","v":0}]
[null,1,"Contacts&Annual Summary","C16","Telephone Number not provided",null,1,"Sales","C17","Please provide a numerical value",null,null,null,"Unleaded petrol (minimum RON = 95)",null,null,"Petrol (5+6)","Diesel (5+6)","5+6",null,null,{"$f":"Sales!A18","v":0},{"$f":"IF(Sales!B18<>\"\",Sales!B18,\"\")","v":""}]
[null,1,"Contacts&Annual Summary","C17","Email not provided",null,1,"Sales","C18","Please provide a numerical value",null,null,null,"Unleaded petrol (minimum RON = 95) E5",null,null,"Petrol (7)","Diesel (7)",7,null,null,{"$f":"Sales!A19","v":0},{"$f":"IF(Sales!B19<>\"\",Sales!B19,\"\")","v":""}]
[null,1,"Contacts&Annual Summary","B41","General Summary of Analysis and Additional Information not provided",null,1,"Sales","C19","Please provide a numerical value",null,null,null,"Unleaded petrol (minimum RON = 95) E10",null,null,"Petrol (8)","Diesel (8)",8,null,null,{"$f":"Sales!A20","v":0},{"$f":"IF(Sales!B20<>\"\",Sales!B20,\"\")","v":""}]
[null,1,"FQMS&Sampling","C13","Starting date of Summer Period not provided",null,1,"Sales","C20","Please provide a numerical value",null,null,null,"Unleaded petrol (minimum RON = 95) E+",null,null,"Petrol (7+8)","Diesel (7+8)","7+8",null,null,{"$f":"Sales!A21","v":0},{"$f":"IF(Sales!B21<>\"\",Sales!B21,\"\")","v":""}]
[null,1,"FQMS&Sampling","C14","Ending date of Summer Period not provided",null,1,"Sales","C21","Please provide a numerical value",null,null,null,"Unleaded petrol (minimum 95 =< RON < 98)",null,null,"Petrol (9)","Diesel (9)",9,null,null,{"$f":"Sales!A22","v":"Unleaded petrol (minimum RON >= 98)1"},{"$f":"IF(Sales!B22<>\"\",Sales!B22,\"\")","v":""}]
[null,1,"FQMS&Sampling","C16","Starting date of Winter Period not provided",null,1,"Sales","C22","Please provide a numerical value",null,null,null,"Unleaded petrol (minimum 95 =< RON < 98) E5",null,null,"Petrol (10)","Diesel (10)",10,null,null,{"$f":"Sales!A23","v":"Unleaded petrol (minimum RON >= 98) E52"},{"$f":"IF(Sales!B23<>\"\",Sales!B23,\"\")","v":0}]
[null,1,"FQMS&Sampling","C17","Ending date of Winter Period not provided",null,1,"Sales","C23","Please provide a numerical value",null,null,null,"Unleaded petrol (minimum 95 =< RON < 98) E10",null,null,"Petrol (9+10)","Diesel (9+10)","9+10",null,null,{"$f":"Sales!A24","v":"Unleaded petrol (minimum RON >= 98) E102"},{"$f":"IF(Sales!B24<>\"\",Sales!B24,\"\")","v":0}]
[null,1,"FQMS&Sampling","B37","Additional information not provided",null,1,"Sales","C24","Please provide a numerical value",null,null,null,"Unleaded petrol (minimum 95 =< RON < 98) E+",null,null,null,"Petrol (1)",null,null,null,{"$f":"Sales!A25","v":"Unleaded petrol (minimum RON >= 98) E+2"},{"$f":"IF(Sales!B25<>\"\",Sales!B25,\"\")","v":0}]
[null,1,"Detailed FQMS","B28","Please provide information on sampling",null,1,"Sales","C25","Please provide a numerical value",null,null,null,"Unleaded petrol (minimum RON >= 98)",null,null,null,"Petrol (2)"]
[null,1,"Detailed FQMS","B42","Please provide information on FQMS administration",null,1,"Sales","C27","Please provide a numerical value",null,null,null,"Unleaded petrol (minimum RON >= 98) E5",null,null,null,"Petrol (1+2)",null,null,null,{"$f":"Sales!A27","v":"Diesel fuel"},{"$f":"IF(Sales!B27<>\"\",Sales!B27,\"\")","v":""}]
[null,1,"Detailed FQMS","B49","Please provide information on National Legislation that transposed the FQD",null,1,"Sales","C29","Please provide a numerical value",null,null,null,"Unleaded petrol (minimum RON >= 98) E10",null,null,null,"Petrol (3)",null,null,null,{"$f":"Sales!A29","v":"Diesel fuel B73"},{"$f":"IF(Sales!B29<>\"\",Sales!B29,\"\")","v":0}]
[null,1,"Detailed FQMS","B58","Please provide information on reporting periods",null,1,"Sales","C30","Please provide a numerical value",null,null,null,"Unleaded petrol (minimum RON >= 98) E+",null,null,null,"Petrol (4)",null,null,null,{"$f":"Sales!A30","v":"Diesel fuel B+4 ( >7% FAME <=30%)"},{"$f":"IF(Sales!B30<>\"\",Sales!B30,\"\")","v":0}]
[null,1,"Sales","A37","Please provide information on how fuel pumps are labeled for MMT content",null,1,"Sales","C31","Please provide a numerical value",null,null,null,null,null,null,null,"Petrol (3+4)",null,null,null,{"$f":"Sales!A31","v":"Diesel fuel B+4 (FAME >30%)"},{"$f":"IF(Sales!B31<>\"\",Sales!B31,\"\")","v":0}]
[null,1,"Sales","A41","Please provide information on customer information on biofuel content",null,1,"Sales","D10","Please provide a numerical value",null,null,null,"Diesel fuel",null,null,null,"Petrol (5)"]
[null,1,"Sales","A45","Please provide additional comments if any",null,1,"Sales","D11","Please provide a numerical value",null,null,null,"Diesel fuel B7",null,null,null,"Petrol (6)"]
[null,null,null,null,null,null,1,"Sales","D12","Please provide a numerical value",null,null,null,"Diesel fuel B+ ( >7% FAME <=30%)",null,null,null,"Petrol (5+6)"]
[null,null,null,null,null,null,1,"Sales","D13","Please provide a numerical value",null,null,null,"Diesel fuel B+ (FAME >30%)",null,null,null,"Petrol (7)"]
[null,null,null,null,null,null,1,"Sales","D14","Please provide a numerical value",null,null,null,null,null,null,null,"Petrol (8)"]
[null,null,null,null,null,null,1,"Sales","D15","Please provide a numerical value",null,null,null,null,null,null,null,"Petrol (7+8)"]
[null,null,null,null,null,null,1,"Sales","D16","Please provide a numerical value",null,null,null,null,null,null,null,"Petrol (9)"]
[null,null,null,null,null,null,1,"Sales","D17","Please provide a numerical value",null,null,null,"Sales petrol samples","Regional Petrol samples",null,null,"Petrol (10)"]
[null,null,null,null,null,null,1,"Sales","D18","Please provide a numerical value",null,null,null,{"$f":"Sales!J26","v":0},{"$f":"'Regional Petrol Sampling (S)'!G31+'Regional Petrol Sampling (W)'!G31","v":0},{"$f":"N31-O31","v":0},null,"Petrol (9+10)"]
[null,null,null,null,null,null,1,"Sales","D19","Please provide a numerical value",null,null,null,"Sales diesel samples","Regional diesel samples"]
[null,null,null,null,null,null,1,"Sales","D20","Please provide a numerical value",null,null,null,{"$f":"Sales!J32","v":0},{"$f":"'Regional Diesel Sampling (S)'!G31+'Regional Diesel Sampling (W)'!G31","v":0},{"$f":"N33-O33","v":0}]
[null,null,null,null,null,null,1,"Sales","D21","Please provide a numerical value"]
[null,null,null,null,null,null,1,"Sales","D22","Please provide a numerical value"]
[null,null,null,null,null,null,1,"Sales","D23","Please provide a numerical value"]
[null,null,null,null,null,null,1,"Sales","D24","Please provide a numerical value"]
[null,null,null,null,null,null,1,"Sales","D25","Please provide a numerical value"]
[null,null,null,null,null,null,1,"Sales","D27","Please provide a numerical value"]
[null,null,null,null,null,null,1,"Sales","D29","Please provide a numerical value"]
[null,null,null,null,null,null,1,"Sales","D30","Please provide a numerical value",null,null,null,"for diesel"]
[null,null,null,null,null,null,1,"Sales","D31","Please provide a numerical value",null,null,null,42,14]
[null,null,null,null,null,null,1,"Sales","E10","Please provide a numerical value",null,null,null,43,15]
[null,null,null,null,null,null,1,"Sales","E11","Please provide a numerical value",null,null,null,44,15]
[null,null,null,null,null,null,1,"Sales","E12","Please provide a numerical value",null,null,null,45,16]
[null,null,null,null,null,null,1,"Sales","E13","Please provide a numerical value",null,null,null,46,17]
[null,null,null,null,null,null,1,"Sales","E14","Please provide a numerical value",null,null,null,47,18]
[null,null,null,null,null,null,1,"Sales","E15","Please provide a numerical value",null,null,null,48,18]
[null,null,null,null,null,null,1,"Sales","E16","Please provide a numerical value",null,null,null,49,19]
[null,null,null,null,null,null,1,"Sales","E17","Please provide a numerical value",null,null,null,50,20]
[null,null,null,null,null,null,1,"Sales","E18","Please provide a numerical value",null,null,null,51,20]
[null,null,null,null,null,null,1,"Sales","E19","Please provide a numerical value"]
[null,null,null,null,null,null,1,"Sales","E20","Please provide a numerical value"]
[null,null,null,null,null,null,1,"Sales","E21","Please provide a numerical value"]
[null,null,null,null,null,null,1,"Sales","E22","Please provide a numerical value"]
[null,null,null,null,null,null,1,"Sales","E23","Please provide a numerical value"]
[null,null,null,null,null,null,1,"Sales","E24","Please provide a numerical value"]
[null,null,null,null,null,null,1,"Sales","E25","Please provide a numerical value"]
[null,null,null,null,null,null,1,"Sales","E27","Please provide a numerical value"]
[null,null,null,null,null,null,1,"Sales","E29","Please provide a numerical value"]
[null,null,null,null,null,null,1,"Sales","E30","Please provide a numerical value",null,null,null,"for petrol"]
[null,null,null,null,null,null,1,"Sales","E31","Please provide a numerical value",null,null,null,62,17]
[null,null,null,null,null,null,1,"Sales","F10","Please provide a numerical value","Integer",null,null,63,17]
[null,null,null,null,null,null,1,"Sales","F11","Please provide a numerical value","Integer",null,null,64,18]
[null,null,null,null,null,null,1,"Sales","F12","Please provide a numerical value","Integer",null,null,65,18]
[null,null,null,null,null,null,1,"Sales","F13","Please provide a numerical value","Integer",null,null,66,0]
[null,null,null,null,null,null,1,"Sales","F14","Please provide a numerical value","Integer",null,null,67,20]
[null,null,null,null,null,null,1,"Sales","F15","Please provide a numerical value","Integer",null,null,68,20]
[null,null,null,null,null,null,1,"Sales","F16","Please provide a numerical value","Integer",null,null,69,20]
[null,null,null,null,null,null,1,"Sales","F17","Please provide a numerical value","Integer",null,null,70,20]
[null,null,null,null,null,null,1,"Sales","F18","Please provide a numerical value","Integer",null,null,71,20]
[null,null,null,null,null,null,1,"Sales","F19","Please provide a numerical value","Integer",null,null,72,20]
[null,null,null,null,null,null,1,"Sales","F20","Please provide a numerical value","Integer",null,null,73,20]
[null,null,null,null,null,null,1,"Sales","F21","Please provide a numerical value","Integer",null,null,74,0]
[null,null,null,null,null,null,1,"Sales","F22","Please provide a numerical value","Integer",null,null,75,22]
[null,null,null,null,null,null,1,"Sales","F23","Please provide a numerical value","Integer",null,null,76,23]
[null,null,null,null,null,null,1,"Sales","F24","Please provide a numerical value","Integer",null,null,77,0]
[null,null,null,null,null,null,1,"Sales","F25","Please provide a numerical value","Integer",null,null,78,25]
[null,null,null,null,null,null,1,"Sales","F27","Please provide a numerical value","Integer",null,null,79,25]
[null,null,null,null,null,null,1,"Sales","F29","Please provide a numerical value","Integer",null,null,80,25]
[null,null,null,null,null,null,1,"Sales","F30","Please provide a numerical value","Integer",null,null,81,25]
[null,null,null,null,null,null,1,"Sales","F31","Please provide a numerical value","Integer",null,null,82,25]
[null,null,null,null,null,null,1,"Sales","G10","Please provide a numerical value","Integer",null,null,83,26]
[null,null,null,null,null,null,1,"Sales","G11","Please provide a numerical value","Integer",null,null,84,27]
[null,null,null,null,null,null,1,"Sales","G12","Please provide a numerical value","Integer",null,null,85,27]
[null,null,null,null,null,null,1,"Sales","G13","Please provide a numerical value","Integer",null,null,86,27]
[null,null,null,null,null,null,1,"Sales","G14","Please provide a numerical value","Integer",null,null,87,28]
[null,null,null,null,null,null,1,"Sales","G15","Please provide a numerical value","Integer",null,null,88,29]
[null,null,null,null,null,null,1,"Sales","G16","Please provide a numerical value","Integer",null,null,89,0]
[null,null,null,null,null,null,1,"Sales","G17","Please provide a numerical value","Integer",null,null,90,31]
[null,null,null,null,null,null,1,"Sales","G18","Please provide a numerical value","Integer",null,null,91,32]
[null,null,null,null,null,null,1,"Sales","G19","Please provide a numerical value","Integer",null,null,92,33]
[null,null,null,null,null,null,1,"Sales","G20","Please provide a numerical value","Integer",null,null,93,34]
[null,null,null,null,null,null,1,"Sales","G21","Please provide a numerical value","Integer",null,null,94,35]
[null,null,null,null,null,null,1,"Sales","G22","Please provide a numerical value","Integer",null,null,95,36]
[null,null,null,null,null,null,1,"Sales","G23","Please provide a numerical value","Integer",null,null,96,37]
[null,null,null,null,null,null,1,"Sales","G24","Please provide a numerical value","Integer",null,null,97,28]
[null,null,null,null,null,null,1,"Sales","G25","Please provide a numerical value","Integer",null,null,98,29]
[null,null,null,null,null,null,1,"Sales","G27","Please provide a numerical value","Integer",null,null,99,0]
[null,null,null,null,null,null,1,"Sales","G29","Please provide a numerical value","Integer",null,null,100,31]
[null,null,null,null,null,null,1,"Sales","G30","Please provide a numerical value","Integer",null,null,101,32]
[null,null,null,null,null,null,1,"Sales","G31","Please provide a numerical value","Integer",null,null,102,33]
[null,null,null,null,null,null,1,"Sales","H10","Please provide a numerical value","Integer",null,null,103,34]
[null,null,null,null,null,null,1,"Sales","H11","Please provide a numerical value","Integer",null,null,104,35]
[null,null,null,null,null,null,1,"Sales","H12","Please provide a numerical value","Integer",null,null,105,36]
[null,null,null,null,null,null,1,"Sales","H13","Please provide a numerical value","Integer",null,null,106,37]
[null,null,null,null,null,null,1,"Sales","H14","Please provide a numerical value","Integer",null,null,107,28]
[null,null,null,null,null,null,1,"Sales","H15","Please provide a numerical value","Integer",null,null,108,29]
[null,null,null,null,null,null,1,"Sales","H16","Please provide a numerical value","Integer",null,null,109,0]
[null,null,null,null,null,null,1,"Sales","H17","Please provide a numerical value","Integer",null,null,110,31]
[null,null,null,null,null,null,1,"Sales","H18","Please provide a numerical value","Integer",null,null,111,32]
[null,null,null,null,null,null,1,"Sales","H19","Please provide a numerical value","Integer",null,null,112,33]
[null,null,null,null,null,null,1,"Sales","H20","Please provide a numerical value","Integer",null,null,113,34]
[null,null,null,null,null,null,1,"Sales","H21","Please provide a numerical value","Integer",null,null,114,35]
[null,null,null,null,null,null,1,"Sales","H22","Please provide a numerical value","Integer",null,null,115,36]
[null,null,null,null,null,null,1,"Sales","H23","Please provide a numerical value","Integer",null,null,116,37]
[null,null,null,null,null,null,1,"Sales","H24","Please provide a numerical value","Integer",null,null,117,38]
[null,null,null,null,null,null,1,"Sales","H25","Please provide a numerical value","Integer",null,null,118,38]
[null,null,null,null,null,null,1,"Sales","H27","Please provide a numerical value","Integer",null,null,119,38]
[null,null,null,null,null,null,1,"Sales","H29","Please provide a numerical value","Integer",null,null,120,38]
[null,null,null,null,null,null,1,"Sales","H30","Please provide a numerical value","Integer",null,null,121,39]
[null,null,null,null,null,null,1,"Sales","H31","Please provide a numerical value","Integer",null,null,122,40]
[null,null,null,null,null,null,1,"Regional Petrol Sampling (S)","C14","Please provide a numerical value",null,null,null,123,40]
[null,null,null,null,null,null,1,"Regional Petrol Sampling (S)","C15","Please provide a numerical value"]
[null,null,null,null,null,null,1,"Regional Petrol Sampling (S)","C16","Please provide a numerical value"]
[null,null,null,null,null,null,1,"Regional Petrol Sampling (S)","C17","Please provide a numerical value"]
[null,null,null,null,null,null,1,"Regional Petrol Sampling (S)","C18","Please provide a numerical value"]
[null,null,null,null,null,null,1,"Regional Petrol Sampling (S)","C19","Please provide a numerical value"]
[null,null,null,null,null,null,1,"Regional Petrol Sampling (S)","C20","Please provide a numerical value"]
[null,null,null,null,null,null,1,"Regional Petrol Sampling (S)","C21","Please provide a numerical value"]
[null,null,null,null,null,null,1,"Regional Petrol Sampling (S)","C22","Please provide a numerical value"]
[null,null,null,null,null,null,1,"Regional Petrol Sampling (S)","C23","Please provide a numerical value"]
[null,null,null,null,null,null,1,"Regional Petrol Sampling (S)","C24","Please provide a numerical value"]
[null,null,null,null,null,null,1,"Regional Petrol Sampling (S)","C25","Please provide a numerical value"]
[null,null,null,null,null,null,1,"Regional Petrol Sampling (S)","C26","Please provide a numerical value"]
[null,null,null,null,null,null,1,"Regional Petrol Sampling (S)","C27","Please provide a numerical value"]
[null,null,null,null,null,null,1,"Regional Petrol Sampling (S)","C28","Please provide a numerical value"]
[null,null,null,null,null,null,1,"Regional Petrol Sampling (S)","C29","Please provide a numerical value"]
[null,null,null,null,null,null,1,"Regional Petrol Sampling (S)","C9","Please provide a numerical value","Integer"]
[null,null,null,null,null,null,1,"Regional Petrol Sampling (W)","C14","Please provide a numerical value"]
[null,null,null,null,null,null,1,"Regional Petrol Sampling (W)","C15","Please provide a numerical value"]
[null,null,null,null,null,null,1,"Regional Petrol Sampling (W)","C16","Please provide a numerical value"]
[null,null,null,null,null,null,1,"Regional Petrol Sampling (W)","C17","Please provide a numerical value"]
[null,null,null,null,null,null,1,"Regional Petrol Sampling (W)","C18","Please provide a numerical value"]
[null,null,null,null,null,null,1,"Regional Petrol Sampling (W)","C19","Please provide a numerical value"]
[null,null,null,null,null,null,1,"Regional Petrol Sampling (W)","C20","Please provide a numerical value"]
[null,null,null,null,null,null,1,"Regional Petrol Sampling (W)","C21","Please provide a numerical value"]
[null,null,null,null,null,null,1,"Regional Petrol Sampling (W)","C22","Please provide a numerical value"]
[null,null,null,null,null,null,1,"Regional Petrol Sampling (W)","C23","Please provide a numerical value"]
[null,null,null,null,null,null,1,"Regional Petrol Sampling (W)","C24","Please provide a numerical value"]
[null,null,null,null,null,null,1,"Regional Petrol Sampling (W)","C25","Please provide a numerical value"]
[null,null,null,null,null,null,1,"Regional Petrol Sampling (W)","C26","Please provide a numerical value"]
[null,null,null,null,null,null,1,"Regional Petrol Sampling (W)","C27","Please provide a numerical value"]
[null,null,null,null,null,null,1,"Regional Petrol Sampling (W)","C28","Please provide a numerical value"]
[null,null,null,null,null,null,1,"Regional Petrol Sampling (W)","C29","Please provide a numerical value"]
[null,null,null,null,null,null,1,"Regional Petrol Sampling (W)","C9","Please provide a numerical value","Integer"]
[null,null,null,null,null,null,1,"Regional Diesel Sampling (S)","C14","Please provide a numerical value"]
[null,null,null,null,null,null,1,"Regional Diesel Sampling (S)","C15","Please provide a numerical value"]
[null,null,null,null,null,null,1,"Regional Diesel Sampling (S)","C16","Please provide a numerical value"]
[null,null,null,null,null,null,1,"Regional Diesel Sampling (S)","C17","Please provide a numerical value"]
[null,null,null,null,null,null,1,"Regional Diesel Sampling (S)","C18","Please provide a numerical value"]
[null,null,null,null,null,null,1,"Regional Diesel Sampling (S)","C19","Please provide a numerical value"]
[null,null,null,null,null,null,1,"Regional Diesel Sampling (S)","C20","Please provide a numerical value"]
[null,null,null,null,null,null,1,"Regional Diesel Sampling (S)","C21","Please provide a numerical value"]
[null,null,null,null,null,null,1,"Regional Diesel Sampling (S)","C22","Please provide a numerical value"]
[null,null,null,null,null,null,1,"Regional Diesel Sampling (S)","C23","Please provide a numerical value"]
[null,null,null,null,null,null,1,"Regional Diesel Sampling (S)","C24","Please provide a numerical value"]
[null,null,null,null,null,null,1,"Regional Diesel Sampling (S)","C25","Please provide a numerical value"]
[null,null,null,null,null,null,1,"Regional Diesel Sampling (S)","C26","Please provide a numerical value"]
[null,null,null,null,null,null,1,"Regional Diesel Sampling (S)","C27","Please provide a numerical value"]
[null,null,null,null,null,null,1,"Regional Diesel Sampling (S)","C28","Please provide a numerical value"]
[null,null,null,null,null,null,1,"Regional Diesel Sampling (S)","C29","Please provide a numerical value"]
[null,null,null,null,null,null,1,"Regional Diesel Sampling (S)","C9","Please provide a numerical value","Integer"]
[null,null,null,null,null,null,1,"Regional Diesel Sampling (W)","C14","Please provide a numerical value"]
[null,null,null,null,null,null,1,"Regional Diesel Sampling (W)","C15","Please provide a numerical value"]
[null,null,null,null,null,null,1,"Regional Diesel Sampling (W)","C16","Please provide a numerical value"]
[null,null,null,null,null,null,1,"Regional Diesel Sampling (W)","C17","Please provide a numerical value"]
[null,null,null,null,null,null,1,"Regional Diesel Sampling (W)","C18","Please provide a numerical value"]
[null,null,null,null,null,null,1,"Regional Diesel Sampling (W)","C19","Please provide a numerical value"]
[null,null,null,null,null,null,1,"Regional Diesel Sampling (W)","C20","Please provide a numerical value"]
[null,null,null,null,null,null,1,"Regional Diesel Sampling (W)","C21","Please provide a numerical value"]
[null,null,null,null,null,null,1,"Regional Diesel Sampling (W)","C22","Please provide a numerical value"]
[null,null,null,null,null,null,1,"Regional Diesel Sampling (W)","C23","Please provide a numerical value"]
[null,null,null,null,null,null,1,"Regional Diesel Sampling (W)","C24","Please provide a numerical value"]
[null,null,null,null,null,null,1,"Regional Diesel Sampling (W)","C25","Please provide a numerical value"]
[null,null,null,null,null,null,1,"Regional Diesel Sampling (W)","C26","Please provide a numerical value"]
[null,null,null,null,null,null,1,"Regional Diesel Sampling (W)","C27","Please provide a numerical value"]
[null,null,null,null,null,null,1,"Regional Diesel Sampling (W)","C28","Please provide a numerical value"]
[null,null,null,null,null,null,1,"Regional Diesel Sampling (W)","C29","Please provide a numerical value"]
[null,null,null,null,null,null,1,"Regional Diesel Sampling (W)","C9","Please provide a numerical value","Integer"]
[null,null,null,null,null,null,2,"Petrol","B9","Please provide a numerical value"]
[null,null,null,null,null,null,2,"Petrol","C17","Please provide a numerical value","Integer"]
[null,null,null,null,null,null,2,"Petrol","C18","Please provide a numerical value","Integer"]
[null,null,null,null,null,null,2,"Petrol","C20","Please provide a numerical value","Integer"]
[null,null,null,null,null,null,2,"Petrol","C22","Please provide a numerical value","Integer"]
[null,null,null,null,null,null,2,"Petrol","C23","Please provide a numerical value","Integer"]
[null,null,null,null,null,null,2,"Petrol","C25","Please provide a numerical value","Integer"]
[null,null,null,null,null,null,2,"Petrol","C26","Please provide a numerical value","Integer"]
[null,null,null,null,null,null,2,"Petrol","C27","Please provide a numerical value","Integer"]
[null,null,null,null,null,null,2,"Petrol","C28","Please provide a numerical value","Integer"]
[null,null,null,null,null,null,2,"Petrol","C29","Please provide a numerical value","Integer"]
[null,null,null,null,null,null,2,"Petrol","C31","Please provide a numerical value","Integer"]
[null,null,null,null,null,null,2,"Petrol","C32","Please provide a numerical value","Integer"]
[null,null,null,null,null,null,2,"Petrol","C33","Please provide a numerical value","Integer"]
[null,null,null,null,null,null,2,"Petrol","C34","Please provide a numerical value","Integer"]
[null,null,null,null,null,null,2,"Petrol","C35","Please provide a numerical value","Integer"]
[null,null,null,null,null,null,2,"Petrol","C36","Please provide a numerical value","Integer"]
[null,null,null,null,null,null,2,"Petrol","C37","Please provide a numerical value","Integer"]
[null,null,null,null,null,null,2,"Petrol","C38","Please provide a numerical value","Integer"]
[null,null,null,null,null,null,2,"Petrol","C39","Please provide a numerical value","Integer"]
[null,null,null,null,null,null,2,"Petrol","C40","Please provide a numerical value","Integer"]
[null,null,null,null,null,null,2,"Petrol","D17","Please provide a numerical value"]
[null,null,null,null,null,null,2,"Petrol","D18","Please provide a numerical value"]
[null,null,null,null,null,null,2,"Petrol","D20","Please provide a numerical value"]
[null,null,null,null,null,null,2,"Petrol","D22","Please provide a numerical value"]
[null,null,null,null,null,null,2,"Petrol","D23","Please provide a numerical value"]
[null,null,null,null,null,null,2,"Petrol","D25","Please provide a numerical value"]
[null,null,null,null,null,null,2,"Petrol","D26","Please provide a numerical value"]
[null,null,null,null,null,null,2,"Petrol","D27","Please provide a numerical value"]
[null,null,null,null,null,null,2,"Petrol","D28","Please provide a numerical value"]
[null,null,null,null,null,null,2,"Petrol","D29","Please provide a numerical value"]
[null,null,null,null,null,null,2,"Petrol","D31","Please provide a numerical value"]
[null,null,null,null,null,null,2,"Petrol","D32","Please provide a numerical value"]
[null,null,null,null,null,null,2,"Petrol","D33","Please provide a numerical value"]
[null,null,null,null,null,null,2,"Petrol","D34","Please provide a numerical value"]
[null,null,null,null,null,null,2,"Petrol","D35","Please provide a numerical value"]
[null,null,null,null,null,null,2,"Petrol","D36","Please provide a numerical value"]
[null,null,null,null,null,null,2,"Petrol","D37","Please provide a numerical value"]
[null,null,null,null,null,null,2,"Petrol","D38","Please provide a numerical value"]
[null,null,null,null,null,null,2,"Petrol","D39","Please provide a numerical value"]
[null,null,null,null,null,null,2,"Petrol","D40","Please provide a numerical value"]
[null,null,null,null,null,null,2,"Petrol","E17","Please provide a numerical value"]
[null,null,null,null,null,null,2,"Petrol","E18","Please provide a numerical value"]
[null,null,null,null,null,null,2,"Petrol","E20","Please provide a numerical value"]
[null,null,null,null,null,null,2,"Petrol","E22","Please provide a numerical value"]
[null,null,null,null,null,null,2,"Petrol","E23","Please provide a numerical value"]
[null,null,null,null,null,null,2,"Petrol","E25","Please provide a numerical value"]
[null,null,null,null,null,null,2,"Petrol","E26","Please provide a numerical value"]
[null,null,null,null,null,null,2,"Petrol","E27","Please provide a numerical value"]
[null,null,null,null,null,null,2,"Petrol","E28","Please provide a numerical value"]
[null,null,null,null,null,null,2,"Petrol","E29","Please provide a numerical value"]
[null,null,null,null,null,null,2,"Petrol","E31","Please provide a numerical value"]
[null,null,null,null,null,null,2,"Petrol","E32","Please provide a numerical value"]
[null,null,null,null,null,null,2,"Petrol","E33","Please provide a numerical value"]
[null,null,null,null,null,null,2,"Petrol","E34","Please provide a numerical value"]
[null,null,null,null,null,null,2,"Petrol","E35","Please provide a numerical value"]
[null,null,null,null,null,null,2,"Petrol","E36","Please provide a numerical value"]
[null,null,null,null,null,null,2,"Petrol","E37","Please provide a numerical value"]
[null,null,null,null,null,null,2,"Petrol","E38","Please provide a numerical value"]
[null,null,null,null,null,null,2,"Petrol","E39","Please provide a numerical value"]
[null,null,null,null,null,null,2,"Petrol","E40","Please provide a numerical value"]
[null,null,null,null,null,null,2,"Petrol","F17","Please provide a numerical value"]
[null,null,null,null,null,null,2,"Petrol","F18","Please provide a numerical value"]
[null,null,null,null,null,null,2,"Petrol","F20","Please provide a numerical value"]
[null,null,null,null,null,null,2,"Petrol","F22","Please provide a numerical value"]
[null,null,null,null,null,null,2,"Petrol","F23","Please provide a numerical value"]
[null,null,null,null,null,null,2,"Petrol","F25","Please provide a numerical value"]
[null,null,null,null,null,null,2,"Petrol","F26","Please provide a numerical value"]
[null,null,null,null,null,null,2,"Petrol","F27","Please provide a numerical value"]
[null,null,null,null,null,null,2,"Petrol","F28","Please provide a numerical value"]
[null,null,null,null,null,null,2,"Petrol","F29","Please provide a numerical value"]
[null,null,null,null,null,null,2,"Petrol","F31","Please provide a numerical value"]
[null,null,null,null,null,null,2,"Petrol","F32","Please provide a numerical value"]
[null,null,null,null,null,null,2,"Petrol","F33","Please provide a numerical value"]
[null,null,null,null,null,null,2,"Petrol","F34","Please provide a numerical value"]
[null,null,null,null,null,null,2,"Petrol","F35","Please provide a numerical value"]
[null,null,null,null,null,null,2,"Petrol","F36","Please provide a numerical value"]
[null,null,null,null,null,null,2,"Petrol","F37","Please provide a numerical value"]
[null,null,null,null,null,null,2,"Petrol","F38","Please provide a numerical value"]
[null,null,null,null,null,null,2,"Petrol","F39","Please provide a numerical value"]
[null,null,null,null,null,null,2,"Petrol","F40","Please provide a numerical value"]
[null,null,null,null,null,null,2,"Petrol","G17","Please provide a numerical value"]
[null,null,null,null,null,null,2,"Petrol","G18","Please provide a numerical value"]
[null,null,null,null,null,null,2,"Petrol","G20","Please provide a numerical value"]
[null,null,null,null,null,null,2,"Petrol","G22","Please provide a numerical value"]
[null,null,null,null,null,null,2,"Petrol","G23","Please provide a numerical value"]
[null,null,null,null,null,null,2,"Petrol","G25","Please provide a numerical value"]
[null,null,null,null,null,null,2,"Petrol","G26","Please provide a numerical value"]
[null,null,null,null,null,null,2,"Petrol","G27","Please provide a numerical value"]
[null,null,null,null,null,null,2,"Petrol","G28","Please provide a numerical value"]
[null,null,null,null,null,null,2,"Petrol","G29","Please provide a numerical value"]
[null,null,null,null,null,null,2,"Petrol","G31","Please provide a numerical value"]
[null,null,null,null,null,null,2,"Petrol","G32","Please provide a numerical value"]
[null,null,null,null,null,null,2,"Petrol","G33","Please provide a numerical value"]
[null,null,null,null,null,null,2,"Petrol","G34","Please provide a numerical value"]
[null,null,null,null,null,null,2,"Petrol","G35","Please provide a numerical value"]
[null,null,null,null,null,null,2,"Petrol","G36","Please provide a numerical value"]
[null,null,null,null,null,null,2,"Petrol","G37","Please provide a numerical value"]
[null,null,null,null,null,null,2,"Petrol","G38","Please provide a numerical value"]
[null,null,null,null,null,null,2,"Petrol","G39","Please provide a numerical value"]
[null,null,null,null,null,null,2,"Petrol","G40","Please provide a numerical value"]
[null,null,null,null,null,null,2,"Petrol","H17","Please provide a numerical value"]
[null,null,null,null,null,null,2,"Petrol","H18","Please provide a numerical value"]
[null,null,null,null,null,null,2,"Petrol","H20","Please provide a numerical value"]
[null,null,null,null,null,null,2,"Petrol","H22","Please provide a numerical value"]
[null,null,null,null,null,null,2,"Petrol","H23","Please provide a numerical value"]
[null,null,null,null,null,null,2,"Petrol","H25","Please provide a numerical value"]
[null,null,null,null,null,null,2,"Petrol","H26","Please provide a numerical value"]
[null,null,null,null,null,null,2,"Petrol","H27","Please provide a numerical value"]
[null,null,null,null,null,null,2,"Petrol","H28","Please provide a numerical value"]
[null,null,null,null,null,null,2,"Petrol","H29","Please provide a numerical value"]
[null,null,null,null,null,null,2,"Petrol","H31","Please provide a numerical value"]
[null,null,null,null,null,null,2,"Petrol","H32","Please provide a numerical value"]
[null,null,null,null,null,null,2,"Petrol","H33","Please provide a numerical value"]
[null,null,null,null,null,null,2,"Petrol","H34","Please provide a numerical value"]
[null,null,null,null,null,null,2,"Petrol","H35","Please provide a numerical value"]
[null,null,null,null,null,null,2,"Petrol","H36","Please provide a numerical value"]
[null,null,null,null,null,null,2,"Petrol","H37","Please provide a numerical value"]
[null,null,null,null,null,null,2,"Petrol","H38","Please provide a numerical value"]
[null,null,null,null,null,null,2,"Petrol","H39","Please provide a numerical value"]
[null,null,null,null,null,null,2,"Petrol","H40","Please provide a numerical value"]
[null,null,null,null,null,null,2,"Petrol","I17","Please provide a numerical value","Integer"]
[null,null,null,null,null,null,2,"Petrol","I18","Please provide a numerical value","Integer"]
[null,null,null,null,null,null,2,"Petrol","I20","Please provide a numerical value","Integer"]
[null,null,null,null,null,null,2,"Petrol","I22","Please provide a numerical value","Integer"]
[null,null,null,null,null,null,2,"Petrol","I23","Please provide a numerical value","Integer"]
[null,null,null,null,null,null,2,"Petrol","I25","Please provide a numerical value","Integer"]
[null,null,null,null,null,null,2,"Petrol","I26","Please provide a numerical value","Integer"]
[null,null,null,null,null,null,2,"Petrol","I27","Please provide a numerical value","Integer"]
[null,null,null,null,null,null,2,"Petrol","I28","Please provide a numerical value","Integer"]
[null,null,null,null,null,null,2,"Petrol","I29","Please provide a numerical value","Integer"]
[null,null,null,null,null,null,2,"Petrol","I31","Please provide a numerical value","Integer"]
[null,null,null,null,null,null,2,"Petrol","I32","Please provide a numerical value","Integer"]
[null,null,null,null,null,null,2,"Petrol","I33","Please provide a numerical value","Integer"]
[null,null,null,null,null,null,2,"Petrol","I34","Please provide a numerical value","Integer"]
[null,null,null,null,null,null,2,"Petrol","I35","Please provide a numerical value","Integer"]
[null,null,null,null,null,null,2,"Petrol","I36","Please provide a numerical value","Integer"]
[null,null,null,null,null,null,2,"Petrol","I37","Please provide a numerical value","Integer"]
[null,null,null,null,null,null,2,"Petrol","I38","Please provide a numerical value","Integer"]
[null,null,null,null,null,null,2,"Petrol","I39","Please provide a numerical value","Integer"]
[null,null,null,null,null,null,2,"Petrol","I40","Please provide a numerical value","Integer"]
[null,null,null,null,null,null,2,"Petrol","j17","Please provide a numerical value"]
[null,null,null,null,null,null,2,"Petrol","j18","Please provide a numerical value"]
[null,null,null,null,null,null,2,"Petrol","j20","Please provide a numerical value"]
[null,null,null,null,null,null,2,"Petrol","j22","Please provide a numerical value"]
[null,null,null,null,null,null,2,"Petrol","j23","Please provide a numerical value"]
[null,null,null,null,null,null,2,"Petrol","j25","Please provide a numerical value"]
[null,null,null,null,null,null,2,"Petrol","j26","Please provide a numerical value"]
[null,null,null,null,null,null,2,"Petrol","j27","Please provide a numerical value"]
[null,null,null,null,null,null,2,"Petrol","j28","Please provide a numerical value"]
[null,null,null,null,null,null,2,"Petrol","j29","Please provide a numerical value"]
[null,null,null,null,null,null,2,"Petrol","j31","Please provide a numerical value"]
[null,null,null,null,null,null,2,"Petrol","j32","Please provide a numerical value"]
[null,null,null,null,null,null,2,"Petrol","j33","Please provide a numerical value"]
[null,null,null,null,null,null,2,"Petrol","j34","Please provide a numerical value"]
[null,null,null,null,null,null,2,"Petrol","j35","Please provide a numerical value"]
[null,null,null,null,null,null,2,"Petrol","j36","Please provide a numerical value"]
[null,null,null,null,null,null,2,"Petrol","j37","Please provide a numerical value"]
[null,null,null,null,null,null,2,"Petrol","j38","Please provide a numerical value"]
[null,null,null,null,null,null,2,"Petrol","j39","Please provide a numerical value"]
[null,null,null,null,null,null,2,"Petrol","j40","Please provide a numerical value"]
[null,null,null,null,null,null,2,"Petrol","k17","Please provide a numerical value"]
[null,null,null,null,null,null,2,"Petrol","k18","Please provide a numerical value"]
[null,null,null,null,null,null,2,"Petrol","k20","Please provide a numerical value"]
[null,null,null,null,null,null,2,"Petrol","k22","Please provide a numerical value"]
[null,null,null,null,null,null,2,"Petrol","k23","Please provide a numerical value"]
[null,null,null,null,null,null,2,"Petrol","k25","Please provide a numerical value"]
[null,null,null,null,null,null,2,"Petrol","k26","Please provide a numerical value"]
[null,null,null,null,null,null,2,"Petrol","k27","Please provide a numerical value"]
[null,null,null,null,null,null,2,"Petrol","k28","Please provide a numerical value"]
[null,null,null,null,null,null,2,"Petrol","k29","Please provide a numerical value"]
[null,null,null,null,null,null,2,"Petrol","k31","Please provide a numerical value"]
[null,null,null,null,null,null,2,"Petrol","k32","Please provide a numerical value"]
[null,null,null,null,null,null,2,"Petrol","k33","Please provide a numerical value"]
[null,null,null,null,null,null,2,"Petrol","k34","Please provide a numerical value"]
[null,null,null,null,null,null,2,"Petrol","k35","Please provide a numerical value"]
[null,null,null,null,null,null,2,"Petrol","k36","Please provide a numerical value"]
[null,null,null,null,null,null,2,"Petrol","k37","Please provide a numerical value"]
[null,null,null,null,null,null,2,"Petrol","k38","Please provide a numerical value"]
[null,null,null,null,null,null,2,"Petrol","k39","Please provide a numerical value"]
[null,null,null,null,null,null,2,"Petrol","k40","Please provide a numerical value"]
[null,null,null,null,null,null,2,"Petrol","l17","Please provide a numerical value"]
[null,null,null,null,null,null,2,"Petrol","l18","Please provide a numerical value"]
[null,null,null,null,null,null,2,"Petrol","l20","Please provide a numerical value"]
[null,null,null,null,null,null,2,"Petrol","l22","Please provide a numerical value"]
[null,null,null,null,null,null,2,"Petrol","l23","Please provide a numerical value"]
[null,null,null,null,null,null,2,"Petrol","l25","Please provide a numerical value"]
[null,null,null,null,null,null,2,"Petrol","l26","Please provide a numerical value"]
[null,null,null,null,null,null,2,"Petrol","l27","Please provide a numerical value"]
[null,null,null,null,null,null,2,"Petrol","l28","Please provide a numerical value"]
[null,null,null,null,null,null,2,"Petrol","l29","Please provide a numerical value"]
[null,null,null,null,null,null,2,"Petrol","l31","Please provide a numerical value"]
[null,null,null,null,null,null,2,"Petrol","l32","Please provide a numerical value"]
[null,null,null,null,null,null,2,"Petrol","l33","Please provide a numerical value"]
[null,null,null,null,null,null,2,"Petrol","l34","Please provide a numerical value"]
[null,null,null,null,null,null,2,"Petrol","l35","Please provide a numerical value"]
[null,null,null,null,null,null,2,"Petrol","l36","Please provide a numerical value"]
[null,null,null,null,null,null,2,"Petrol","l37","Please provide a numerical value"]
[null,null,null,null,null,null,2,"Petrol","l38","Please provide a numerical value"]
[null,null,null,null,null,null,2,"Petrol","l39","Please provide a numerical value"]
[null,null,null,null,null,null,2,"Petrol","l40","Please provide a numerical value"]
[null,null,null,null,null,null,2,"Petrol","m17","Please provide a numerical value"]
[null,null,null,null,null,null,2,"Petrol","m18","Please provide a numerical value"]
[null,null,null,null,null,null,2,"Petrol","m20","Please provide a numerical value"]
[null,null,null,null,null,null,2,"Petrol","m22","Please provide a numerical value"]
[null,null,null,null,null,null,2,"Petrol","m23","Please provide a numerical value"]
[null,null,null,null,null,null,2,"Petrol","m25","Please provide a numerical value"]
[null,null,null,null,null,null,2,"Petrol","m26","Please provide a numerical value"]
[null,null,null,null,null,null,2,"Petrol","m27","Please provide a numerical value"]
[null,null,null,null,null,null,2,"Petrol","m28","Please provide a numerical value"]
[null,null,null,null,null,null,2,"Petrol","m29","Please provide a numerical value"]
[null,null,null,null,null,null,2,"Petrol","m31","Please provide a numerical value"]
[null,null,null,null,null,null,2,"Petrol","m32","Please provide a numerical value"]
[null,null,null,null,null,null,2,"Petrol","m33","Please provide a numerical value"]
[null,null,null,null,null,null,2,"Petrol","m34","Please provide a numerical value"]
[null,null,null,null,null,null,2,"Petrol","m35","Please provide a numerical value"]
[null,null,null,null,null,null,2,"Petrol","m36","Please provide a numerical value"]
[null,null,null,null,null,null,2,"Petrol","m37","Please provide a numerical value"]
[null,null,null,null,null,null,2,"Petrol","m38","Please provide a numerical value"]
[null,null,null,null,null,null,2,"Petrol","m39","Please provide a numerical value"]
[null,null,null,null,null,null,2,"Petrol","m40","Please provide a numerical value"]
[null,null,null,null,null,null,2,"Petrol","G45","Please provide a numerical value","Integer"]
[null,null,null,null,null,null,2,"Petrol","G46","Please provide a numerical value","Integer"]
[null,null,null,null,null,null,2,"Petrol","G47","Please provide a numerical value","Integer"]
[null,null,null,null,null,null,2,"Petrol","G48","Please provide a numerical value","Integer"]
[null,null,null,null,null,null,2,"Petrol","G49","Please provide a numerical value","Integer"]
[null,null,null,null,null,null,2,"Petrol","H45","Please provide a numerical value","Integer"]
[null,null,null,null,null,null,2,"Petrol","H46","Please provide a numerical value","Integer"]
[null,null,null,null,null,null,2,"Petrol","H47","Please provide a numerical value","Integer"]
[null,null,null,null,null,null,2,"Petrol","H48","Please provide a numerical value","Integer"]
[null,null,null,null,null,null,2,"Petrol","H49","Please provide a numerical value","Integer"]
[null,null,null,null,null,null,3,"Diesel","C8","Please provide a numerical value"]
[null,null,null,null,null,null,3,"Diesel","C14","Please provide a numerical value","Integer"]
[null,null,null,null,null,null,3,"Diesel","C15","Please provide a numerical value","Integer"]
[null,null,null,null,null,null,3,"Diesel","C16","Please provide a numerical value","Integer"]
[null,null,null,null,null,null,3,"Diesel","C17","Please provide a numerical value","Integer"]
[null,null,null,null,null,null,3,"Diesel","C18","Please provide a numerical value","Integer"]
[null,null,null,null,null,null,3,"Diesel","C19","Please provide a numerical value","Integer"]
[null,null,null,null,null,null,3,"Diesel","C20","Please provide a numerical value","Integer"]
[null,null,null,null,null,null,3,"Diesel","D14","Please provide a numerical value"]
[null,null,null,null,null,null,3,"Diesel","D15","Please provide a numerical value"]
[null,null,null,null,null,null,3,"Diesel","D16","Please provide a numerical value"]
[null,null,null,null,null,null,3,"Diesel","D17","Please provide a numerical value"]
[null,null,null,null,null,null,3,"Diesel","D18","Please provide a numerical value"]
[null,null,null,null,null,null,3,"Diesel","D19","Please provide a numerical value"]
[null,null,null,null,null,null,3,"Diesel","D20","Please provide a numerical value"]
[null,null,null,null,null,null,3,"Diesel","E14","Please provide a numerical value"]
[null,null,null,null,null,null,3,"Diesel","E15","Please provide a numerical value"]
[null,null,null,null,null,null,3,"Diesel","E16","Please provide a numerical value"]
[null,null,null,null,null,null,3,"Diesel","E17","Please provide a numerical value"]
[null,null,null,null,null,null,3,"Diesel","E18","Please provide a numerical value"]
[null,null,null,null,null,null,3,"Diesel","E19","Please provide a numerical value"]
[null,null,null,null,null,null,3,"Diesel","E20","Please provide a numerical value"]
[null,null,null,null,null,null,3,"Diesel","F14","Please provide a numerical value"]
[null,null,null,null,null,null,3,"Diesel","F15","Please provide a numerical value"]
[null,null,null,null,null,null,3,"Diesel","F16","Please provide a numerical value"]
[null,null,null,null,null,null,3,"Diesel","F17","Please provide a numerical value"]
[null,null,null,null,null,null,3,"Diesel","F18","Please provide a numerical value"]
[null,null,null,null,null,null,3,"Diesel","F19","Please provide a numerical value"]
[null,null,null,null,null,null,3,"Diesel","F20","Please provide a numerical value"]
[null,null,null,null,null,null,3,"Diesel","G14","Please provide a numerical value"]
[null,null,null,null,null,null,3,"Diesel","G15","Please provide a numerical value"]
[null,null,null,null,null,null,3,"Diesel","G16","Please provide a numerical value"]
[null,null,null,null,null,null,3,"Diesel","G17","Please provide a numerical value"]
[null,null,null,null,null,null,3,"Diesel","G18","Please provide a numerical value"]
[null,null,null,null,null,null,3,"Diesel","G19","Please provide a numerical value"]
[null,null,null,null,null,null,3,"Diesel","G20","Please provide a numerical value"]
[null,null,null,null,null,null,3,"Diesel","H14","Please provide a numerical value"]
[null,null,null,null,null,null,3,"Diesel","H15","Please provide a numerical value"]
[null,null,null,null,null,null,3,"Diesel","H16","Please provide a numerical value"]
[null,null,null,null,null,null,3,"Diesel","H17","Please provide a numerical value"]
[null,null,null,null,null,null,3,"Diesel","H18","Please provide a numerical value"]
[null,null,null,null,null,null,3,"Diesel","H19","Please provide a numerical value"]
[null,null,null,null,null,null,3,"Diesel","H20","Please provide a numerical value"]
[null,null,null,null,null,null,3,"Diesel","I14","Please provide a numerical value","Integer"]
[null,null,null,null,null,null,3,"Diesel","I15","Please provide a numerical value","Integer"]
[null,null,null,null,null,null,3,"Diesel","I16","Please provide a numerical value","Integer"]
[null,null,null,null,null,null,3,"Diesel","I17","Please provide a numerical value","Integer"]
[null,null,null,null,null,null,3,"Diesel","I18","Please provide a numerical value","Integer"]
[null,null,null,null,null,null,3,"Diesel","I19","Please provide a numerical value","Integer"]
[null,null,null,null,null,null,3,"Diesel","I20","Please provide a numerical value","Integer"]
[null,null,null,null,null,null,3,"Diesel","j14","Please provide a numerical value"]
[null,null,null,null,null,null,3,"Diesel","j15","Please provide a numerical value"]
[null,null,null,null,null,null,3,"Diesel","j16","Please provide a numerical value"]
[null,null,null,null,null,null,3,"Diesel","j17","Please provide a numerical value"]
[null,null,null,null,null,null,3,"Diesel","j18","Please provide a numerical value"]
[null,null,null,null,null,null,3,"Diesel","j19","Please provide a numerical value"]
[null,null,null,null,null,null,3,"Diesel","j20","Please provide a numerical value"]
[null,null,null,null,null,null,3,"Diesel","k14","Please provide a numerical value"]
[null,null,null,null,null,null,3,"Diesel","k15","Please provide a numerical value"]
[null,null,null,null,null,null,3,"Diesel","k16","Please provide a numerical value"]
[null,null,null,null,null,null,3,"Diesel","k17","Please provide a numerical value"]
[null,null,null,null,null,null,3,"Diesel","k18","Please provide a numerical value"]
[null,null,null,null,null,null,3,"Diesel","k19","Please provide a numerical value"]
[null,null,null,null,null,null,3,"Diesel","k20","Please provide a numerical value"]
[null,null,null,null,null,null,3,"Diesel","l14","Please provide a numerical value"]
[null,null,null,null,null,null,3,"Diesel","l15","Please provide a numerical value"]
[null,null,null,null,null,null,3,"Diesel","l16","Please provide a numerical value"]
[null,null,null,null,null,null,3,"Diesel","l17","Please provide a numerical value"]
[null,null,null,null,null,null,3,"Diesel","l18","Please provide a numerical value"]
[null,null,null,null,null,null,3,"Diesel","l19","Please provide a numerical value"]
[null,null,null,null,null,null,3,"Diesel","l20","Please provide a numerical value"]
[null,null,null,null,null,null,3,"Diesel","m14","Please provide a numerical value"]
[null,null,null,null,null,null,3,"Diesel","m15","Please provide a numerical value"]
[null,null,null,null,null,null,3,"Diesel","m16","Please provide a numerical value"]
[null,null,null,null,null,null,3,"Diesel","m17","Please provide a numerical value"]
[null,null,null,null,null,null,3,"Diesel","m18","Please provide a numerical value"]
[null,null,null,null,null,null,3,"Diesel","m19","Please provide a numerical value"]
[null,null,null,null,null,null,3,"Diesel","m20","Please provide a numerical value"]
[null,null,null,null,null,null,3,"Diesel","B25","Please provide a numerical value","Integer"]
[null,null,null,null,null,null,3,"Diesel","B26","Please provide a numerical value","Integer"]
[null,null,null,null,null,null,3,"Diesel","B27","Please provide a numerical value","Integer"]
[null,null,null,null,null,null,3,"Diesel","B28","Please provide a numerical value","Integer"]
[null,null,null,null,null,null,3,"Diesel","B29","Please provide a numerical value","Integer"]
[null,null,null,null,null,null,3,"Diesel","B30","Please provide a numerical value","Integer"]
[null,null,null,null,null,null,3,"Diesel","d25","Please provide a numerical value","Integer"]
[null,null,null,null,null,null,3,"Diesel","d26","Please provide a numerical value","Integer"]
[null,null,null,null,null,null,3,"Diesel","d27","Please provide a numerical value","Integer"]
[null,null,null,null,null,null,3,"Diesel","d28","Please provide a numerical value","Integer"]
[null,null,null,null,null,null,3,"Diesel","d29","Please provide a numerical value","Integer"]
[null,null,null,null,null,null,3,"Diesel","d30","Please provide a numerical value","Integer"]
[null,null,null,null,null,null,3,"Diesel","d31","Please provide a numerical value","Integer"]

{"sheet":"Introduction","index":2,"n_rows":39,"n_cols":1,"rows_kept":39,"cut":false,"hidden":false,"merged":[[0,0,37,21]]}
["EU Fuel Quality Monitoring Submissions – 2023 Reporting Year\n\nAll reports should be submitted to the EIONET Central Data Repository no later than 31 August; see guidance from the European Environment Agency (EEA) concerning reporting instructions. After submitting your report, you should also notify the European Commission at ENV-98-70-Implementation@ec.europa.eu.\n\nIntroduction, purpose & format\n\nDirective 98/70/EC of the European Parliament and of the Council of 13 October 1998 relating to the quality of petrol and diesel fuels, as last amended by Directive 2009/30/EC and Directive 2011/63/EU, sets the environmental specifications for all petrol and diesel fuel marketed in the European Union. These specifications can be found in Annexes I to IV of the Directive. Article 8(1) obliges the Member States to monitor the compliance with these fuel quality specifications according to the analytical measurement methods referred to in the Directive and subsequent amends.\n\nBy no later than 31 August each year the Member States must submit a summary of fuel quality monitoring data collected during the period January to December of the previous calendar year. Member States are required to report according to European Standard EN 14274:2003, unless they use a national fuel quality monitoring system of equivalent confidence.\n\nThe purpose of this online reporting system is to assist Member States in data reporting, and;\n• Facilitate the collation and interpretation of Member State submissions, reducing the need to return to Member States for additional information;\n• Provide additional guidance to Member States on the provision of information that would assist in the interpretation/understanding of both their national fuel quality monitoring systems and the significance of the results of sample analysis in the annual EU Fuel Quality Monitoring Summary Report.\n\nThe format of this reporting platform broadly follows that of Commission Decision 2002/159/EC and has been revised and approved by the European Commission Directorate General responsible for ensuring compliance with the Directive. Your assistance in providing submission data using this online reporting platform is greatly appreciated.\n\nWe have provided instructions (see Instructions tab) for filling in the required data. The information requested in the tab “Detailed FQMS” is required for the 2019 submission, but will not be required for the next two submissions.\n\nIf you have any queries regarding this reporting platform, please do not hesitate to contact the EEA at fqd@eea.europa.eu.\n\nThank you again for your assistance with this work."]
[]
[]
[]
[]
[]
[]
[]
[]
[]
[]
[]
[]
[]
[]
[]
[]
[]
[]
[]
[]
[]
[]
[]
[]
[]
[]
[]
[]
[]
[]
[]
[]
[]
[]
[]
[]
[]
[" "]

{"sheet":"Instructions","index":3,"n_rows":1,"n_cols":1,"rows_kept":1,"cut":false,"hidden":false,"merged":[[0,0,73,21]]}
["Instructions and guide to new reporting requests\n\nCertain additional information is requested in order to gain a complete picture of Member State fuel quality monitoring systems and compliance with Directive specifications.\n\n\n1. Description of fuel quality monitoring system  in the <Detailed FQMS> tab\nMember States have been asked, in 2012 for the first time, to provide a detailed breakdown of the Fuel Quality Monitoring System used. Updates to this information will be requested on a 3-yearly basis.\nThe additional optional information requested serves several purposes: to clarify the method of sample collection and analysis; to put into context/explain the reasons for differences in national fuel quality monitoring systems;  to identify how the Fuel Quality Monitoring System is managed; to provide details on how the fuel quality legislation has been transposed into national law; and to clarify reporting periods.\n\n2. Description of fuel quality monitoring system  in the <FQMS&Sampling> tab\nThe information requested has been reduced. However, Member States are requested to provide details of any changes to the Fuel Quality Monitoring System that have been implemented since the last detailed breakdown of the Fuel Quality Monitoring System.\n\n3. Petrol and Diesel sample analysis reporting tables\nChanges introduced in the 2011 template:\na) Separate tables are requested for different RON and different sulphur grades in order to identify any particular issues with different fuel types;\nb) Additional clarifying information is requested to help interpret correctly the significance of any exceedances of the limit values and allow Member States the opportunity to provide information on how such potential exceedances are followed up.\n\n4. Reporting fuel sales and sample numbers in the <Sales> tab\nChanges introduced in the 2011 template:\na) Member States are requested to provide detail about the location of fuel sampling in the sales tab.  This helps to assess the number of samples according to Directive requirements.  Sampling at service stations (retail or commercial fuel dispensing sites where fuel is dispensed into road vehicles for propulsion) means that the fuel is being sampled at the point of use and reduces the risk of contamination in the supply chain before use.  Sampling at the end of the distribution chain (i.e. dispensing/refuelling sites) ensures that any contamination is identified before it reaches the vehicle, whilst sampling the whole distribution chain will also help identify at what point any potential contamination might have occurred.\n\n5. Statistical analysis to enhance accuracy requested in reporting tabs {<Petrol (1)> through to <Diesel (1 + 2)>}\na) As in the 2009 , 2010, 2011, 2012 and 2013 report templates, Member States are requested to provide the median value for each parameter tested.  Providing the Median helps in the statistical analysis of fuel quality throughout the EU.  \nb) Additional parameters as required by the Directive; provision has been made, in the 2011 template onwards, for reporting test results for MMT (including labelling), FAME (diesel) and the Vapour Pressure Waiver for petrol that contains bioethanol.\nc) In the 2010 template onwards, Member States are asked to provide further data on the distribution of the fuel samples, this will aid the Commission in further understanding of the fuel within the member states.  The data required included:\n\n• Column \"No Samples outside 95% tolerance limit\": Please provide the number of samples that fail to reach the tolerance limit (95% Confidence) as set out in the <Methods&Limits> tab.\n\n• Column \"25% of Sample Value\": Please provide where the 25% level of the fuel sample dataset occurs, e.g.: if a sample dataset has 11 values of {21,22,23,24,25,26,27,28,29,30,31}\nThe 25% value is the 3rd value = 23\n\n• Column \"75% of Sample Value\": Please provide where the 75% level of the dataset occurs, e.g.: if a sample has 11 values of {21,22,23,24,25,26,27,28,29,30,31}\nThe 75% value is the 9th value = 29\n\nTo aid users, this can be calculated by using the QUARTILE function in Excel (For more information on using this, see: http://office.microsoft.com/en-us/excel-help/quartile-HP005209226.aspx?CTT=1)"]

{"sheet":"Methods&Limits","index":4,"n_rows":88,"n_cols":9,"rows_kept":88,"cut":false,"hidden":false,"merged":[[78,2,78,3],[78,7,78,8],[77,2,77,3],[73,0,73,8],[77,4,77,8],[72,0,72,8],[5,2,5,3],[6,7,6,8],[6,2,6,3],[5,4,5,8],[71,0,71,8]]}
["Directive 98/70/EC: Test Methods, Limit Values and Tolerance Limits*"]
["*Based on information provided by the Belgium, the German Environmental Protection Agency, Italy, Irish EPA, UK DTI and CEN TC19"]
[]
["Petrol"]
[]
["Parameter","Unit","98/70/EC",null,"Test specified in 2009/30/EC or EN 228:2012+A1:2017"]
[null,null,"Limit values",null,"Method","Date","Reproducibility, R*","Tolerance limits\n(95% confidence)"]
[null,null,"Min.","Max.",null,null,null,"Minimum","Maximum"]
["Research Octane Number (RON)","--",95,null,"EN-ISO 5164",2014,0.7,{"$f":"C9-0.59*G9","v":94.587000000000003}]
["(RON 91 fuel only)","--",91,null,"EN-ISO 5164",2014,0.7,{"$f":"C10-0.59*G10","v":90.587000000000003}]
["Motor Octane Number (MON)","--",85,null,"EN-ISO 5163",2014,0.9,{"$f":"C11-0.59*G11","v":84.468999999999994}]
["(RON 91 fuel only)","--",81,null,"EN-ISO 5163",2014,0.9,{"$f":"C12-0.59*G12","v":80.468999999999994}]
["Vapour Pressure, DVPE"]
["--summer period (normal)","kPa",null,60,"EN 13016-1",2018,2.2000000000000002,null,{"$f":"D14+0.59*G14","v":61.298000000000002}]
["-- Petrol with bioethanol content 0-2","kPa",null,{"$f":"D14+5.95","v":65.95},"EN 1601",2017,2.2999999999999998,null,{"$f":"D15+0.59*G15","v":67.307000000000002}]
["-- Petrol with bioethanol content 2-4","kPa",null,{"$f":"D14+7.8","v":67.8},"EN 1601",2017,2.2999999999999998,null,{"$f":"D16+0.59*G16","v":69.156999999999996}]
["-- Petrol with bioethanol content 4-6","kPa",null,{"$f":"D14+8","v":68},"EN 1601",2017,2.2999999999999998,null,{"$f":"D17+0.59*G17","v":69.356999999999999}]
["-- Petrol with bioethanol content 6-8","kPa",null,{"$f":"D14+7.88","v":67.88},"EN 1601",2017,2.2999999999999998,null,{"$f":"D18+0.59*G18","v":69.236999999999995}]
["-- Petrol with bioethanol content 8-10","kPa",null,{"$f":"D14+7.76","v":67.760000000000005},"EN 1601",2017,2.2999999999999998,null,69.117000000000004]
["--summer period (arctic or severe weather conditions)","kPa",null,70,"EN 13016-1",2018,2.2999999999999998,null,{"$f":"D20+0.59*G20","v":71.356999999999999}]
["Distillation *"]
["--evaporated at 100 oC","% V/V",46,null,"EN-ISO 3405",2020,4,{"$f":"C22-0.59*G22","v":43.64}]
["-- evaporated at 150 oC ","% V/V",75,null,"EN-ISO 3405",2020,4,{"$f":"C23-0.59*G23","v":72.64}]
["Hydrocarbon analysis"]
["-- Olefins","% V/V",null,18,"EN 15553",2021,6.4,null,{"$f":"D25+0.59*G25","v":21.776}]
[null,null,null,{"$f":"D25","v":18},"EN-ISO 22854",2021,2.6,null,19.533999999999999]
["*without oxygenates",null,null,{"$f":"D25","v":18},"EN 15553",2021,"-",null,"-"]
[null,null,null,null,"EN-ISO 22854",2021,"-",null,"-"]
["-- Olefins (RON 91 fuel only)***","% V/V",null,21,"ASTM D1319",2020,5.0999999999999996,null,24.009]
["-- Aromatics (from 2005)",null,null,35,"EN-ISO 22854",2021,1.7,null,36.003]
["-- Benzene","% V/V",null,1,"EN 12177",2022,0.1,null,1.0589999999999999]
[null,null,null,{"$f":"D31","v":1},"EN 238",1996,{"$f":"0.17","v":0.17},null,1.1003000000000001]
[null,null,null,{"$f":"D32","v":1},"EN-ISO 22854",2021,0.05,null,{"$f":"D33+0.59*G33","v":1.0295000000000001}]
["Oxygen content","% (m/m)",null,3.7,"EN 1601",2017,0.41,null,{"$f":"D34+0.59*G34","v":3.9419}]
[null,null,null,2.7,"EN 1601",2017,0.41,null,{"$f":"D35+0.59*G35","v":2.9419}]
["Oxygenates"]
["-- Methanol","% V/V",null,3,"EN 1601",2017,0.3,null,{"$f":"D37+0.59*G37","v":3.177}]
["-- Ethanol","% V/V",null,10,"EN 1601",2017,0.8,null,10.472]
["-- Iso-propyl alcohol","% V/V",null,12,"EN 1601",2017,0.9,null,12.531000000000001]
["-- Tert-butyl alcohol","% V/V",null,15,"EN 1601",2017,1,null,15.59]
["-- Iso-butyl alcohol","% V/V",null,15,"EN 1601",2017,1,null,15.59]
["-- Ethers with 5 or more carbon atoms per molecule","% V/V",null,22,"EN 1601",2017,1,null,22.59]
["-- other oxygenates","% V/V",null,15,"EN 1601",2017,1,null,15.59]
["Oxygen content","% (m/m)",null,3.7,"EN 13132",2002,0.3,null,3.8770000000000002]
[null,null,null,2.7,"EN 13132",2002,0.3,null,2.8770000000000002]
["Oxygenates"]
["-- Methanol","% V/V",null,3,"EN 13132",2002,0.3,null,{"$f":"D47+0.59*G47","v":3.177}]
["-- Ethanol","% V/V",null,10,"EN 13132",2002,0.8,null,10.472]
["-- Iso-propyl alcohol","% V/V",null,12,"EN 13132",2002,0.8,null,12.472]
["-- Tert-butyl alcohol","% V/V",null,15,"EN 13132",2002,1,null,15.59]
["-- Iso-butyl alcohol","% V/V",null,15,"EN 13132",2002,1,null,{"$f":"D51+0.59*G51","v":15.59}]
["-- Ethers with 5 or more carbon atoms per molecule","% V/V",null,22,"EN 13132",2002,1,null,22.59]
["-- other oxygenates","% V/V",null,15,"EN 13132",2002,1,null,15.59]
["Oxygen content","% (m/m)",null,3.7,"EN-ISO 22854",2021,0.4,null,3.9359999999999999]
[null,null,null,2.7,"EN-ISO 22854",2021,0.4,null,2.9359999999999999]
["Oxyginates"]
["-- Methanol","% V/V",null,3,"EN-ISO 22854",2021,0.4,null,{"$f":"D57+0.59*G57","v":3.2359999999999998}]
["-- Ethanol","% V/V",null,10,"EN-ISO 22854",2021,0.6,null,{"$f":"D58+0.59*G58","v":10.353999999999999}]
["-- Iso-propyl alcohol","% V/V",null,12,"EN-ISO 22854",2021,0.7,null,12.413]
["-- Tert-butyl alcohol","% V/V",null,15,"EN-ISO 22854",2021,0.7,null,15.413]
["-- Iso-butyl alcohol","% V/V",null,15,"EN-ISO 22854",2021,0.7,null,15.413]
["-- Ethers with 5 or more carbon atoms per molecule","% V/V",null,22,"EN-ISO 22854",2021,0.9,null,22.530999999999999]
["-- other oxygenates","% V/V",null,15,"EN-ISO 22854",2021,0.7,null,15.413]
["Sulphur content (sulphur free, from 2005)**","mg/kg",null,10,"EN-ISO 14596",2018,5,null,{"$f":"D64+0.59*G64","v":12.95}]
[null,null,null,{"$f":"D64","v":10},"EN 24260",1994,1,null,10.59]
[null,null,null,{"$f":"D65","v":10},"EN-ISO 20846",2019,2.7,null,11.593]
[null,null,null,{"$f":"D66","v":10},"EN-ISO 20884",2019,3.1,null,11.829000000000001]
["Lead content","g/l",null,5.0000000000000001E-3,"EN 237",2004,6.1999999999999998E-3,null,8.657999999999999E-3]
[]
[]
[]
["* R values and limits are fixed precision statements provided by CEN, to be used in the absence of specific values from Member States.  Member States may use and report their own defined R depending on their testing conditions."]
["**According to Directive amendment 2003/17/EC \"By no later than 1 January 2009, Member States shall ensure that unleaded petrol may be marketed in their territory only if it complies with the environmental specification set out in Annex III except for the sulphur content which shall be a maximum of 10 mg/kg.\""]
["***RON91 is not covered by EN228:2008: MS who wish to sample and report Olefines for RON91 should:\na) use method ASTM D1319 as in previous years \nb) report only the quantity of fuel sold"]
[]
["Diesel"]
[]
["Parameter","Unit","98/70/EC",null,"Test specified in 2009/30/EC or EN 590:2013+A1:2017"]
[null,null,"Limit values",null,"Method","Date","Reproducability, R*","Tolerance limits\n(95% confidence)"]
[null,null,"Min.","Max.",null,null,null,"Minimum","Maximum"]
["Cetane number","--",51,"--","EN-ISO 5165",2020,4.3,{"$f":"C81-0.59*G81","v":48.463000000000001}]
["Density at 15 oC","kg/m3",null,845,"EN-ISO 3675",2022,1.2,null,{"$f":"D82+0.59*G82","v":845.70799999999997}]
[null,null,null,null,"EN-ISO 12185",2024,{"$f":"(I83-D82)/0.59","v":0.50847457627110937},null,845.3]
["Distillation -- 95% Point","oC",null,360,"EN-ISO 3405",2019,10,null,{"$f":"D84+0.59*G84","v":365.9}]
["Polycyclic aromatic hydrocarbons","% (m/m)",null,8,"EN 12916",2019,1.9,null,{"$f":"D85+0.59*G85","v":9.1210000000000004}]
["Sulphur content (sulphur free, from 2005)","mg/kg",null,10,"EN-ISO 20846",2019,2.2000000000000002,null,{"$f":"D86+0.59*G86","v":11.298}]
[null,null,null,{"$f":"D86","v":10},"EN-ISO 20884",2019,3.1,null,{"$f":"D87+0.59*G87","v":11.829000000000001}]
["FAME Content","% V/V",null,10,"EN14078",2014,0.5,null,{"$f":"D88+0.59*G88","v":10.295}]

{"sheet":"Contacts&Annual Summary","index":5,"n_rows":40,"n_cols":4,"rows_kept":40,"cut":false,"hidden":false,"merged":[[39,1,39,2],[40,1,47,2],[3,1,3,6],[5,1,5,4],[18,1,18,6],[20,1,20,2],[21,1,21,2],[22,1,22,2],[24,1,24,6]]}
[null,null,null,"<-- GO BACK"]
[null,"Contacts & Summary"]
[]
[null,"Details of those compiling the Fuel Quality Monitoring Report"]
[]
[null,"The authorities responsible for compiling the fuel quality monitoring report are requested to complete the table below."]
[]
[null,"Reporting Year:",2023]
[null,"Country:"]
[null,"Date Report Completed:"]
[null,"Organisation Responsible for Report"]
[null,"Address of Organisation Street:   "]
[null,"    City:   "]
[null,"Postcode:   "]
[null,"Person Responsible for Report:"]
[null,"Telephone Number:"]
[null,"Email:"]
[]
[null,"DEFINITIONS AND EXPLANATION"]
[]
[null,"Parent fuel grade: Directive 98/70/EC sets the environmental specifications for petrol and diesel fuel marketed in the EU. The specifications in the Directive can be thought of as ‘parent fuel grades’. These include (i) regular unleaded petrol (RON > 91), (ii) unleaded petrol (RON > 95) and (iii) diesel fuel."]
[null,"National fuel grade: Member States may, of course, define ‘national’ fuel grades which must still, however, respect the specification of the parent fuel grade. For example, national fuel grades may comprise super unleaded petrol (RON > 98), lead replacement petrol, zero sulphur petrol, zero sulphur diesel, etc."]
[null,"Zero sulphur or sulphur-free fuels: As of 1st January 2009 sulphur content of all fuels marketed within a member state territory must not exceed a maximum of 10 mg/kg."]
[]
[null,"SUMMARY REPORTING FORMAT FOR PETROL & DIESEL"]
[]
[null,"Member States are requested to provide a brief general summary of the results of the year's monitoring, including information on any:"]
[null,"- other parameters measured;"]
[null,"- exclusions;"]
[null,"- further details on breaches of parameter tolerance limits (i.e. number of samples, values);"]
[null,"- enforcement actions taken as a result of breaches of the limit values/tolerance limits; and"]
[null,"- additional information deemed relevant."]
[]
[null,"In particular, Member States should provide additional explanatory information on reasoning for exceptional cases where exclusions are made, such as:"]
[null,"- fuel grades marketed in very small quantities;"]
[null,"- mandatory fuel parameters that are not measured;"]
[null,"- geographical areas that are left outside the monitoring programme;"]
[null,"- exceptionally high or low values of analytical results (i.e. outliers)."]
[]
[null,"General Summary of Analysis and Additional Information:"]

{"sheet":"FQMS&Sampling","index":6,"n_rows":36,"n_cols":7,"rows_kept":36,"cut":false,"hidden":false,"merged":[[35,1,35,6],[25,3,25,4],[36,1,38,6],[21,1,21,6],[32,1,32,6],[33,1,33,6],[34,1,34,6],[20,1,20,6],[23,3,23,7],[18,1,18,6],[8,1,8,6],[24,3,24,4],[19,1,19,2]]}
[]
[null,"Fuel Quality Monitoring System",null,null,null,null,"<-- GO BACK"]
[]
[null,"Year:",{"$f":"'Contacts&Annual Summary'!C8","v":2023}]
[]
[null,"Description of Fuel Quality Monitoring System"]
[]
[null,"Member States should provide details on the operation of their national fuel quality monitoring systems."]
[null,"Directive 98/70/EC requires the vapour pressure of petrol to be less than 60.0 kPa during the summer period, which spans 1 May until 30 September. However, for those Member States that experience ‘arctic or severe weather conditions’ the summer period covers the period 1 June to 31 August and the vapour pressure must not exceed 70 kPa.  Member States are requested to define the Summer/Winter periods implemented in their territories and also applying to their fuel quality monitoring system reporting.    "]
[null,"Definition of Monitoring System Summer and Winter Periods:"]
[]
[null,"Summer Period"]
[null,"Start"]
[null,"End"]
[null,"Winter Period"]
[null,"Start"]
[null,"End"]
[null,"* Normal = 1st May to 30th September; Arctic = 1st June to 31st August"]
[null,"2009/30/EC states that the summer period shall begin no later than 1 May and shall not end before 30 September.  For Member States with a low ambient summer temperatures the summer period shall begin no later than 1 June and shall not end before 31 August. See Annex I footnote 4."]
[null,"Has a Vapour Pressure Waiver been granted?\nIf yes, please provide details in the space below:",null,"Please Select"]
[]
[null,"Member States should indicate below whether their monitoring system is set up using the European Standard EN 14274:2003 statistical model A, B or C and whether it is based on the large or small country framework.  Alternatively, the Member State should indicate if they are using their own nationally defined system.  Where using a Nationally defined system, please include details of the system and the reson for using this system based on National conditions."]
[]
[null,"Country Size (L = Large, S = Small)",null,"Please Note: A country is classified as Large if total automotive fuel sales exceed 15 millions tons per annum."]
[null,null,null,"Minimum number of samples each period*"]
[null,null,null,"(Petrol, per grade; Diesel)"]
[null,"Fuel Quality Monitoring System model used:","Yes / No","Small Country","Large Country"]
[null,"EN 14274 Statistical Model A","No",50,100]
[null,"EN 14274 Statistical Model B","No",100,200]
[null,"EN 14274 Statistical Model C","No",50,"--"]
[null,"National System","No","--","--"]
[]
[null,"If Member States are using the European Standard EN 14274:2003, they should also provide details on the sampling programme by completing the relevant sections of the table in Annex I (as defined in Annexes B and C of EN 14274:2003), plus details of any additional provisions made in the table below."]
[]
[null,"* The minimum number of samples as specified in European Standard EN 14274 refers to a minimum number of samples taken from Fuel Dispensing sites in order to determine fuel quality at the point of use.  If sampling has taken place in terminals or refineries, please provide additional information detailing the number of samples per fuel grade at each sample location in the section below."]
[null,"ADDITIONAL INFORMATION/ ANNUAL FQM UPDATES OR SIGNIFICANT FQMS UPDATE: \n\nMember States have been asked, in 2012 for the first time to provide a detailed breakdown of the Fuel Quality Monitoring System used. Updates to this information will be requested on a 3-yearly basis (see tab 'Detailed FQMS').  In the interim years, Member States are requested to please provide details in the box below of any changes to the Fuel Quality Monitoring System that have been implemented since the last detailed breakdown of the Fuel Quality Monitoring System.\n\nThis includes; \n- Any change to the national monitoring system used\n- Derogations received since the last detailed FQMS report\n- Significant changes to sampling quantities or location since the last detailed FQM report\n- Any delays to provision of the annual fuel quality data report"]

{"sheet":"Detailed FQMS","index":7,"n_rows":57,"n_cols":10,"rows_kept":57,"cut":false,"hidden":false,"merged":[[9,3,9,6],[27,1,29,9],[41,1,43,9],[48,1,50,9],[57,1,59,9],[11,3,11,4],[10,3,10,4]]}
[]
[null,"Fuel Quality Monitoring System",null,null,null,null,null,null,null,"<-- GO BACK"]
[]
[null,"Please use this section to provide detailed information about the Fuel Quality Monitoring System that has been adopted by the Member State. "]
[null,"From 2012, this information will be requested in detail by the Commission every three years - however, information about any amendments to the FQMS that take"]
[null,"place in the intervening years should be provided as soon as possible (within the next reporting year) and a space has been provided in tab <FQMS&Sampling> for this "]
[null,"purpose."]
[]
[null,"FUEL QUALITY MONITORING MODEL"]
[null,"Country Size (L = Large, S = Small)",{"$f":"'FQMS&Sampling'!C24","v":0},"Please Note: A country is classified as Large if total automotive \nfuel sales exceed 15 millions tons per annum."]
[null,null,null,"Minimum number of samples each period*"]
[null,null,null,"(Petrol, per grade; Diesel)"]
[null,"Fuel Quality Monitoring System model used:","Yes / No","Small Country","Large Country"]
[null,"EN 14274 Statistical Model A",{"$f":"'FQMS&Sampling'!C28","v":"No"},{"$f":"'FQMS&Sampling'!D28","v":50},{"$f":"'FQMS&Sampling'!E28","v":100}]
[null,"EN 14274 Statistical Model B",{"$f":"'FQMS&Sampling'!C29","v":"No"},{"$f":"'FQMS&Sampling'!D29","v":100},{"$f":"'FQMS&Sampling'!E29","v":200}]
[null,"EN 14274 Statistical Model C",{"$f":"'FQMS&Sampling'!C30","v":"No"},{"$f":"'FQMS&Sampling'!D30","v":50},{"$f":"'FQMS&Sampling'!E30","v":"--"}]
[null,"National System",{"$f":"'FQMS&Sampling'!C31","v":"No"},{"$f":"'FQMS&Sampling'!D31","v":"--"},{"$f":"'FQMS&Sampling'!E31","v":"--"}]
[null,"* The minimum number of samples as specified in European Standard EN 14274 refers to a minimum number of samples taken from fuel dispensing sites in"]
[null,"order to determine fuel quality at the point of use. "]
[]
[null,"SAMPLING"]
[null,"In this section, please provide as much information as possioble about how the sampling system has been designed, including;"]
[null,"- Organisation(s) responsible for sampling, analysis and reporting;"]
[null,"- Types of locations at which sampling is carried out (e.g. refineries, terminals/depots, or from refuelling stations);"]
[null,"- Frequency of sampling and selection of sampling points;"]
[null,"- Assessment that shows the monitoring system’s equivalency to the CEN system, and;"]
[null,"- Test methods used to sample the different parameters."]
[]
[]
[]
[]
[null,"FQMS ADMINISTRATION"]
[null,"Please provide details of how the Fuel Quality Monitoring System is managed - this section should contain information about;"]
[null,"- Which public body (or bodies) have responsibility for managing and implementing the FQM Directive "]
[null,"- How fuel sampling is managed - e.g. is fuel sampling carried out by a public body, contracted privately and when is annual data provided"]
[null,"- Which public body is responsible for taking action where non-compliant samples have been discovered - and the processes in place to report, manage and "]
[null,"  monitor such non-compliance"]
[null,"- When and how was the system been designed e.g. whether using a National System or a EN 14274 models A, B or C, what national considerations have "]
[null,"  been taken into account during design and implementation?"]
[null,"- Number of National refineries and distribution terminals"]
[null,"- Please also provide any reason why the annual Fuel Quality Monitoring data report cannot be provided according to the annual deadline date of 30th June."]
[]
[]
[]
[]
[null,"NATIONAL LEGISLATION THAT TRANSPOSED THE FQD"]
[null,"In order to meet the requirements of the Fuel Quality Directive, member states have been required to transpose elements of the Directive into their own"]
[null,"legislative structure.  Please use the space below to give details of how the fuel quality legislation has been transposed into national law."]
[]
[]
[]
[]
[null,"REPORTING PERIODS"]
[null,"Please use the section below to provide information about seasonal periods and if an 'Arctic' derogation has been granted."]
[null,"In addition, this section should include information about the transition periods between summer and winter grade fuels and how this transition period is handled; e.g."]
[null,"- Are samples taken and tested during the transition period?"]
[null,"- Are the results of samples taken during the transition period reported within the annual fuel quality report - or excluded as transitional?"]

{"sheet":"Sales","index":8,"n_rows":44,"n_cols":11,"rows_kept":44,"cut":false,"hidden":false,"merged":[[43,0,43,5],[44,0,45,5],[7,3,7,4],[7,5,7,9],[6,0,6,9],[35,0,35,5],[36,0,37,5],[39,0,39,5],[40,0,41,5],[33,0,33,5]]}
["Total Sales of Petrol and Diesel",null,null,null,null,null,null,null,null,null,"<-- GO BACK"]
["Year:",{"$f":"'Contacts&Annual Summary'!C8","v":2023}]
[]
["Member states are requested to complete the following table, as applicable detailing the quantities of each type and grade of petrol and diesel fuel marketed in their territory."]
[]
[]
["*NB: Please do not report national fuel grade sales under more than one category.  \nBlank rows have been provided where petrol fuel sales to be reported contain bioethanol.\n"]
["Fuel Grade","Name of national","Biofuel","National sales total",null,"No. Samples"]
[null," fuel grade","Content","Litres","Tonnes","Service Stations","Terminals","Refinery","Location not available","Total"]
["Regular unleaded petrol (minimum RON >= 91)1"]
["Regular unleaded petrol (minimum RON >= 91) E52","kl",0,0,0,0,0,0,0,{"$f":"SUM(F11:I11)","v":0}]
["Regular unleaded petrol (minimum RON >= 91) E102","op",0,0,0,0,0,0,0,0]
["Regular unleaded petrol (minimum RON >= 91) E+2",0,0,0,0,0,0,0,0,0]
["Unleaded petrol (minimum RON >= 95)1"]
["Unleaded petrol (minimum RON >= 95) E52",0,0.05,0,0,0,0,0,0,0]
["Unleaded petrol (minimum RON >= 95) E102",0,0.1,0,0,0,0,0,0,{"$f":"SUM(F16:I16)","v":0}]
["Unleaded petrol (minimum RON >= 95) E+2",0,0.25,1111,0,0,0,0,0,0]
[]
[]
[]
[]
["Unleaded petrol (minimum RON >= 98)1"]
["Unleaded petrol (minimum RON >= 98) E52",0,0,0,0,0,0,0,0,0]
["Unleaded petrol (minimum RON >= 98) E102",0,0,0,0,0,0,0,0,0]
["Unleaded petrol (minimum RON >= 98) E+2",0,0,0,0,0,0,0,0,0]
["Total Petrol",null,null,{"$f":"SUM(D10:D25)","v":1111},0,0,0,0,0,0]
["Diesel fuel"]
["-"]
["Diesel fuel B73",0,0,0,0,0,0,0,0,{"$f":"SUM(F29:I29)","v":0}]
["Diesel fuel B+4 ( >7% FAME <=30%)",0,0,0,0,0,0,0,0,{"$f":"SUM(F30:I30)","v":0}]
["Diesel fuel B+4 (FAME >30%)",0,0,0,0,0,0,0,0,{"$f":"SUM(F31:I31)","v":0}]
["Total Diesel",null,null,{"$f":"SUM(D27:D31)","v":0},0,0,0,0,0,0]
["1 as specified in Annex I of Directive 98/70/EC with maximum sulphur content of 10ppm."]
["2 E5 denotes fuels/petrol with up to 5 % ethanol content where the ethanol is derived from biofuels (OR where ethanol is of biogenic origin)\n   E10 indicates fuels/petrol with up to 10 % ethanol content where the ethanol content comes from biofuels (OR where ethanol is of biogenic origin). \n   E+ indicates biofuels blends with > 10 % ethanol."]
["3 B7 includes diesel fuels with up to 7 % FAME and; \n4 B+ represents FAME blends of > 7 % \n"]
["From 1 January 2011, the MMT content of fuels is limited to 6mg.  In addition, Directive 2009/30/EC specifies that fuels with MMT content should be labelled at the pump with the words: “Contains metallic additives”.  Please provide any additional detail about labelling of fuels at the pump."]
[]
[]
[]
["Article 3, Paragraph 3 of Directive 2009/30/EC requests that Member States ensure the provision of appropriate information to consumers concerning the biofuel content of petrol and, in particular, on the appropriate use of different blends of petrol.  Please use this space to provide information about how this has been achieved where biofuels are available for sale to consumers."]
[]
[]
[]
["Comments (completeness of data, particular issues, additional information, etc.)"]

{"sheet":"Regional Petrol Sampling (S)","index":9,"n_rows":38,"n_cols":15,"rows_kept":38,"cut":false,"hidden":false,"merged":[[10,5,12,5],[37,1,37,6],[38,1,38,6],[10,1,12,1],[10,2,12,2],[10,3,12,3],[10,4,12,4],[10,6,10,13],[6,2,6,4],[5,2,5,4],[3,2,3,4],[2,2,2,4],[4,2,4,4]]}
[null,"Fuel Quality Monitoring System Regional Sampling of Petrol and Diesel (1)",null,null,null,null,null,null,null,null,null,null,null,null,"<-- GO BACK"]
[]
[null,"Country:",{"$f":"'Contacts&Annual Summary'!C9","v":0}]
[null,"Fuel type (petrol only):","Petrol"]
[null,"Statistical Model (A, B or C) (2)",{"$f":"IF(COUNTIF('FQMS&Sampling'!C28:C31,\"Yes\")>1,\"Unknown\",IF(COUNTIF('FQMS&Sampling'!C28:C31,\"Yes\")=0,\"Select Model used in FQMS\",INDEX('FQMS&Sampling'!B28:B31,MATCH(\"Yes\",'FQMS&Sampling'!C28:C31,0))))","v":"Select Model used in FQMS"}]
[null,"Reporting Year:",{"$f":"'Contacts&Annual Summary'!C8","v":2023}]
[null,"Period (Summer or Winter):","Summer only"]
[]
[null,"Min. number of samples:",0]
[]
[null,"Macro / Non-Macro Regions (add extra rows as needed)","Fuel Sales (tonnes)","Variability factor (3)","Proportion of total samples","Min. number of Samples per grade (4)","Actual number of samples taken"]
[null,null,null,null,null,null,"Grade:","Grade 1","Grade 2","Grade 3","Grade 4","Grade 5","Grade 6","Grade 7"]
[null,null,null,null,null,null,"Name/ID:","kl"]
[1,0,0,0,{"$f":"IF(C14=0,\"-\",C14/$C$31)","v":"-"},{"$f":"IF(C14=0,\"-\",IF(INT($C$9*E14)<1,1,INT($C$9*E14)))","v":"-"}]
[2,0,0,0,{"$f":"IF(C15=0,\"-\",C15/$C$31)","v":"-"},"-"]
[3,0,0,0,"-","-"]
[4,0,0,0,"-","-"]
[5,0,0,0,"-","-"]
[6,0,0,0,"-","-"]
[7,0,0,0,"-","-"]
[8,0,0,0,"-","-"]
[9,0,0,0,"-","-"]
[10,0,0,0,"-","-"]
[11,0,0,0,"-","-"]
[12,0,0,0,"-","-"]
[13,0,0,0,"-","-"]
[14,0,0,0,"-","-"]
[15,0,0,0,"-","-"]
[16,0,0,0,{"$f":"IF(C29=0,\"-\",C29/$C$31)","v":"-"},{"$f":"IF(C29=0,\"-\",IF(INT($C$9*E29)<1,1,INT($C$9*E29)))","v":"-"}]
[null,"Remainder","--","--","--",{"$f":"IF($C$9-SUM(F14:F29)<0,0,$C$9-SUM(F14:F29))","v":0},null,{"$f":"IF(H13=\"\",\"\",IF(H$9-SUM(H14:H29)<0,0,H$9-SUM(H14:H29)))","v":0},"","","","","",""]
[null,"Total",{"$f":"SUM(C14:C29)","v":0},null,{"$f":"SUM(E14:E29)","v":0},{"$f":"SUM(F14:F29)","v":0},{"$f":"SUM(H31:N31)","v":0},{"$f":"SUM(H14:H29)","v":0},{"$f":"SUM(I14:I29)","v":0},0,0,0,0,0]
[]
[null,"(1)         As defined in Annexes B and C of EN 14274:2003"]
[null,"(2)         Definitions according to those provided in EN 14274:2003."]
[null,"(3)         Only for statistical Model A"]
[null,"(4)         For grades comprising <10% total sales, the minimum is calculated as: %sales x min. for parent grade (at least 1 sample)"]
[]
[null,"Additional Notes (e.g. identification of grades comprising <10% total sales)"]

{"sheet":"Regional Petrol Sampling (W)","index":10,"n_rows":38,"n_cols":15,"rows_kept":38,"cut":false,"hidden":false,"merged":[[10,5,12,5],[37,1,37,6],[38,1,38,6],[10,1,12,1],[10,2,12,2],[10,3,12,3],[10,4,12,4],[10,6,10,13],[6,2,6,4],[5,2,5,4],[4,2,4,4],[3,2,3,4],[2,2,2,4]]}
[null,"Fuel Quality Monitoring System Regional Sampling of Petrol and Diesel (1)",null,null,null,null,null,null,null,null,null,null,null,null,"<-- GO BACK"]
[]
[null,"Country:",{"$f":"'Contacts&Annual Summary'!C9","v":0}]
[null,"Fuel type (petrol only):","Petrol"]
[null,"Statistical Model (A, B or C) (2)",{"$f":"IF(COUNTIF('FQMS&Sampling'!C28:C31,\"Yes\")>1,\"Unknown\",IF(COUNTIF('FQMS&Sampling'!C28:C31,\"Yes\")=0,\"Select Model used in FQMS\",INDEX('FQMS&Sampling'!B28:B31,MATCH(\"Yes\",'FQMS&Sampling'!C28:C31,0))))","v":"Select Model used in FQMS"}]
[null,"Reporting Year:",{"$f":"'Contacts&Annual Summary'!C8","v":2023}]
[null,"Period (Summer or Winter):","Winter only"]
[]
[null,"Min. number of samples:",{"$f":"'Regional Petrol Sampling (S)'!C9","v":0}]
[]
[null,"Macro / Non-Macro Regions (add extra rows as needed)","Fuel Sales (tonnes)","Variability factor (3)","Proportion of total samples","Min. number of Samples per grade (4)","Actual number of samples taken"]
[null,null,null,null,null,null,"Grade:","Grade 1","Grade 2","Grade 3","Grade 4","Grade 5","Grade 6","Grade 7"]
[null,null,null,null,null,null,"Name/ID:",{"$f":"IF('Regional Petrol Sampling (S)'!H13=\"\",\"\",'Regional Petrol Sampling (S)'!H13)","v":"kl"},{"$f":"IF('Regional Petrol Sampling (S)'!I13=\"\",\"\",'Regional Petrol Sampling (S)'!I13)","v":""},{"$f":"IF('Regional Petrol Sampling (S)'!J13=\"\",\"\",'Regional Petrol Sampling (S)'!J13)","v":""},{"$f":"IF('Regional Petrol Sampling (S)'!K13=\"\",\"\",'Regional Petrol Sampling (S)'!K13)","v":""},{"$f":"IF('Regional Petrol Sampling (S)'!L13=\"\",\"\",'Regional Petrol Sampling (S)'!L13)","v":""},{"$f":"IF('Regional Petrol Sampling (S)'!M13=\"\",\"\",'Regional Petrol Sampling (S)'!M13)","v":""},{"$f":"IF('Regional Petrol Sampling (S)'!N13=\"\",\"\",'Regional Petrol Sampling (S)'!N13)","v":""}]
[1,0,0,0,{"$f":"IF(C14=0,\"-\",C14/$C$31)","v":"-"},{"$f":"IF(C14=0,\"-\",IF(INT($C$9*E14)<1,1,INT($C$9*E14)))","v":"-"}]
[2,0,0,0,{"$f":"IF(C15=0,\"-\",C15/$C$31)","v":"-"},"-"]
[3,0,0,0,"-","-"]
[4,0,0,0,"-","-"]
[5,0,0,0,"-","-"]
[6,0,0,0,"-","-"]
[7,0,0,0,"-","-"]
[8,0,0,0,"-","-"]
[9,0,0,0,"-","-"]
[10,0,0,0,"-","-"]
[11,0,0,0,"-","-"]
[12,0,0,0,"-","-"]
[13,0,0,0,"-","-"]
[14,0,0,0,"-","-"]
[15,0,0,0,"-","-"]
[16,0,0,0,{"$f":"IF(C29=0,\"-\",C29/$C$31)","v":"-"},{"$f":"IF(C29=0,\"-\",IF(INT($C$9*E29)<1,1,INT($C$9*E29)))","v":"-"}]
[null,"Remainder","--","--","--",{"$f":"IF($C$9-SUM(F14:F29)<0,0,$C$9-SUM(F14:F29))","v":0},null,{"$f":"IF(H13=\"\",\"\",IF(H$9-SUM(H14:H29)<0,0,H$9-SUM(H14:H29)))","v":0},"","","","","",""]
[null,"Total",{"$f":"SUM(C14:C29)","v":0},null,{"$f":"SUM(E14:E29)","v":0},{"$f":"SUM(F14:F29)","v":0},{"$f":"SUM(H31:N31)","v":0},{"$f":"SUM(H14:H29)","v":0},0,0,0,0,0,0]
[]
[null,"(1)         As defined in Annexes B and C of EN 14274:2003"]
[null,"(2)         Definitions according to those provided in EN 14274:2003."]
[null,"(3)         Only for statistical Model A"]
[null,"(4)         For grades comprising <10% total sales, the minimum is calculated as: %sales x min. for parent grade (at least 1 sample)"]
[]
[null,"Additional Notes (e.g. identification of grades comprising <10% total sales)"]

{"sheet":"Regional Diesel Sampling (S)","index":11,"n_rows":38,"n_cols":15,"rows_kept":38,"cut":false,"hidden":false,"merged":[[10,5,12,5],[37,1,37,6],[38,1,38,6],[10,1,12,1],[10,2,12,2],[10,3,12,3],[10,4,12,4],[10,6,10,13],[6,2,6,4],[5,2,5,4],[4,2,4,4],[3,2,3,4],[2,2,2,4]]}
[null,"Fuel Quality Monitoring System Regional Sampling of Petrol and Diesel (1)",null,null,null,null,null,null,null,null,null,null,null,null,"<-- GO BACK"]
[]
[null,"Country:",{"$f":"'Contacts&Annual Summary'!C9","v":0}]
[null,"Fuel type (diesel only):","Diesel"]
[null,"Statistical Model (A, B or C) (2)",{"$f":"IF(COUNTIF('FQMS&Sampling'!C28:C31,\"Yes\")>1,\"Unknown\",IF(COUNTIF('FQMS&Sampling'!C28:C31,\"Yes\")=0,\"Select Model used in FQMS\",INDEX('FQMS&Sampling'!B28:B31,MATCH(\"Yes\",'FQMS&Sampling'!C28:C31,0))))","v":"Select Model used in FQMS"}]
[null,"Reporting Year:",{"$f":"'Contacts&Annual Summary'!C8","v":2023}]
[null,"Period (Summer or Winter):","Summer only"]
[]
[null,"Min. number of samples:",0]
[]
[null,"Macro / Non-Macro Regions (add extra rows as needed)","Fuel Sales (tonnes)","Variability factor (3)","Proportion of total samples","Min. number of Samples per grade (4)","Actual number of samples taken"]
[null,null,null,null,null,null,"Grade:","Grade 1","Grade 2","Grade 3","Grade 4","Grade 5","Grade 6","Grade 7"]
[null,null,null,null,null,null,"Name/ID:"]
[1,0,0,0,{"$f":"IF(C14=0,\"-\",C14/$C$31)","v":"-"},{"$f":"IF(C14=0,\"-\",IF(INT($C$9*E14)<1,1,INT($C$9*E14)))","v":"-"}]
[2,0,0,0,{"$f":"IF(C15=0,\"-\",C15/$C$31)","v":"-"},"-"]
[3,0,0,0,"-","-"]
[4,0,0,0,"-","-"]
[5,0,0,0,"-","-"]
[6,0,0,0,"-","-"]
[7,0,0,0,"-","-"]
[8,0,0,0,"-","-"]
[9,0,0,0,"-","-"]
[10,0,0,0,"-","-"]
[11,0,0,0,"-","-"]
[12,0,0,0,"-","-"]
[13,0,0,0,"-","-"]
[14,0,0,0,"-","-"]
[15,0,0,0,"-","-"]
[16,0,0,0,{"$f":"IF(C29=0,\"-\",C29/$C$31)","v":"-"},{"$f":"IF(C29=0,\"-\",IF(INT($C$9*E29)<1,1,INT($C$9*E29)))","v":"-"}]
[null,"Remainder","--","--","--",{"$f":"IF($C$9-SUM(F14:F29)<0,0,$C$9-SUM(F14:F29))","v":0},null,{"$f":"IF(H13=\"\",\"\",IF(H$9-SUM(H14:H29)<0,0,H$9-SUM(H14:H29)))","v":""},"","","","","",""]
[null,"Total",{"$f":"SUM(C14:C29)","v":0},null,{"$f":"SUM(E14:E29)","v":0},{"$f":"SUM(F14:F29)","v":0},{"$f":"SUM(H31:N31)","v":0},{"$f":"SUM(H14:H29)","v":0},0,0,0,0,0,0]
[]
[null,"(1)         As defined in Annexes B and C of EN 14274:2003"]
[null,"(2)         Definitions according to those provided in EN 14274:2003."]
[null,"(3)         Only for statistical Model A"]
[null,"(4)         For grades comprising <10% total sales, the minimum is calculated as: %sales x min. for parent grade (at least 1 sample)"]
[]
[null,"Additional Notes (e.g. identification of grades comprising <10% total sales)"]

{"sheet":"Regional Diesel Sampling (W)","index":12,"n_rows":38,"n_cols":15,"rows_kept":38,"cut":false,"hidden":false,"merged":[[10,5,12,5],[37,1,37,6],[38,1,38,6],[10,1,12,1],[10,2,12,2],[10,3,12,3],[10,4,12,4],[10,6,10,13],[6,2,6,4],[5,2,5,4],[4,2,4,4],[3,2,3,4],[2,2,2,4]]}
[null,"Fuel Quality Monitoring System Regional Sampling of Petrol and Diesel (1)",null,null,null,null,null,null,null,null,null,null,null,null,"<-- GO BACK"]
[]
[null,"Country:",{"$f":"'Contacts&Annual Summary'!C9","v":0}]
[null,"Fuel type (diesel only):","Diesel"]
[null,"Statistical Model (A, B or C) (2)",{"$f":"IF(COUNTIF('FQMS&Sampling'!C28:C31,\"Yes\")>1,\"Unknown\",IF(COUNTIF('FQMS&Sampling'!C28:C31,\"Yes\")=0,\"Select Model used in FQMS\",INDEX('FQMS&Sampling'!B28:B31,MATCH(\"Yes\",'FQMS&Sampling'!C28:C31,0))))","v":"Select Model used in FQMS"}]
[null,"Reporting Year:",{"$f":"'Contacts&Annual Summary'!C8","v":2023}]
[null,"Period (Summer or Winter):","Winter only"]
[]
[null,"Min. number of samples:",{"$f":"'Regional Diesel Sampling (S)'!C9","v":0}]
[]
[null,"Macro / Non-Macro Regions (add extra rows as needed)","Fuel Sales (tonnes)","Variability factor (3)","Proportion of total samples","Min. number of Samples per grade (4)","Actual number of samples taken"]
[null,null,null,null,null,null,"Grade:","Grade 1","Grade 2","Grade 3","Grade 4","Grade 5","Grade 6","Grade 7"]
[null,null,null,null,null,null,"Name/ID:",{"$f":"IF('Regional Diesel Sampling (S)'!H13=\"\",\"\",'Regional Diesel Sampling (S)'!H13)","v":""},{"$f":"IF('Regional Diesel Sampling (S)'!I13=\"\",\"\",'Regional Diesel Sampling (S)'!I13)","v":""},{"$f":"IF('Regional Diesel Sampling (S)'!J13=\"\",\"\",'Regional Diesel Sampling (S)'!J13)","v":""},{"$f":"IF('Regional Diesel Sampling (S)'!K13=\"\",\"\",'Regional Diesel Sampling (S)'!K13)","v":""},{"$f":"IF('Regional Diesel Sampling (S)'!L13=\"\",\"\",'Regional Diesel Sampling (S)'!L13)","v":""},{"$f":"IF('Regional Diesel Sampling (S)'!M13=\"\",\"\",'Regional Diesel Sampling (S)'!M13)","v":""},{"$f":"IF('Regional Diesel Sampling (S)'!N13=\"\",\"\",'Regional Diesel Sampling (S)'!N13)","v":""}]
[1,0,0,0,{"$f":"IF(C14=0,\"-\",C14/$C$31)","v":"-"},{"$f":"IF(C14=0,\"-\",IF(INT($C$9*E14)<1,1,INT($C$9*E14)))","v":"-"}]
[2,0,0,0,{"$f":"IF(C15=0,\"-\",C15/$C$31)","v":"-"},"-"]
[3,0,0,0,"-","-"]
[4,0,0,0,"-","-"]
[5,0,0,0,"-","-"]
[6,0,0,0,"-","-"]
[7,0,0,0,"-","-"]
[8,0,0,0,"-","-"]
[9,0,0,0,"-","-"]
[10,0,0,0,"-","-"]
[11,0,0,0,"-","-"]
[12,0,0,0,"-","-"]
[13,0,0,0,"-","-"]
[14,0,0,0,"-","-"]
[15,0,0,0,"-","-"]
[16,0,0,0,{"$f":"IF(C29=0,\"-\",C29/$C$31)","v":"-"},{"$f":"IF(C29=0,\"-\",IF(INT($C$9*E29)<1,1,INT($C$9*E29)))","v":"-"}]
[null,"Remainder","--","--","--",{"$f":"IF($C$9-SUM(F14:F29)<0,0,$C$9-SUM(F14:F29))","v":0},null,{"$f":"IF(H13=\"\",\"\",IF(H$9-SUM(H14:H29)<0,0,H$9-SUM(H14:H29)))","v":""},"","","","","",""]
[null,"Total",{"$f":"SUM(C14:C29)","v":0},null,{"$f":"SUM(E14:E29)","v":0},{"$f":"SUM(F14:F29)","v":0},{"$f":"SUM(H31:N31)","v":0},{"$f":"SUM(H14:H29)","v":0},0,0,0,0,0,0]
[]
[null,"(1)         As defined in Annexes B and C of EN 14274:2003"]
[null,"(2)         Definitions according to those provided in EN 14274:2003."]
[null,"(3)         Only for statistical Model A"]
[null,"(4)         For grades comprising <10% total sales, the minimum is calculated as: %sales x min. for parent grade (at least 1 sample)"]
[]
[null,"Additional Notes (e.g. identification of grades comprising <10% total sales)"]

{"sheet":"Petrol (1)","index":13,"n_rows":121,"n_cols":18,"rows_kept":121,"cut":false,"hidden":false,"merged":[[122,11,122,12],[5,1,5,4],[6,1,6,4],[13,11,13,14],[2,6,9,16],[7,2,7,4],[2,1,2,4],[3,1,3,4],[97,11,97,12],[87,11,87,12],[4,1,4,4],[102,11,102,12],[101,11,101,12],[14,15,14,16],[13,2,14,10],[14,11,14,12],[43,0,43,3],[47,4,47,11],[48,4,48,11],[14,13,14,14],[13,15,13,16],[20,15,22,15],[44,4,45,11],[46,4,46,11],[27,16,28,16],[27,15,28,15],[121,11,121,12],[120,11,120,12],[119,11,119,12],[118,11,118,12],[100,11,100,12],[106,11,106,12],[117,11,117,12],[116,11,116,12],[105,11,105,12],[104,11,104,12],[103,11,103,12],[110,11,110,12],[115,11,115,12],[114,11,114,12],[113,11,113,12],[112,11,112,12],[94,11,94,12],[80,11,80,12],[93,11,93,12],[92,11,92,12],[83,11,83,12],[82,11,82,12],[81,11,81,12],[91,11,91,12],[90,11,90,12],[89,11,89,12],[86,11,86,12],[85,11,85,12],[109,11,109,12],[107,11,107,12],[99,11,99,12],[96,11,96,12],[95,11,95,12],[111,11,111,12],[84,11,84,12],[59,5,59,6],[59,9,60,9],[53,0,53,11],[58,2,58,8],[75,11,75,12],[74,11,74,12],[72,11,72,12],[71,11,71,12],[64,11,64,12],[63,11,63,12],[62,11,62,12],[61,11,61,12],[69,11,69,12],[68,11,68,12],[78,11,78,12],[79,11,79,12],[59,11,59,12],[49,4,49,11],[50,4,50,11],[77,11,77,12],[66,11,66,12],[58,9,58,12],[70,11,70,12],[67,11,67,12]]}
["Market Fuels used in Vehicles with Spark Ignition Engines (Petrol)",null,null,null,null,null,null,null,null,null,null,null,null,null,null,null,null,"<-- GO BACK"]
[]
["Country",{"$f":"IF(LEN('Contacts&Annual Summary'!C9) > 1,'Contacts&Annual Summary'!C9,\"\")","v":""},null,null,null,null,"Notes on completing the tables\nThe table structure has been locked to prevent modification - data can be copied and pasted, in bulk into the Reporting Results blue table cells.  Where a white row exists between rows, it will not be possible to paste over white rows and sections should be pasted separately.\n\nColumn H in the Test Methods and Analysis table is set to automatically check whether the values entered in the Reporting Results table exceed maximum or minimum Tolerance Limits.  If any exceedance is detected, please provide details in the columns to the right including the number of samples, location samples were taken from, Values and Details of any action taken to address non-compliant samples.  Compliance information is verified manually and this automated compliance check is not solely relied upon during data analysis.\n\nPlease do not unlock this template - modified templates cannot be processed and may delay reporting."]
["Reporting Year",{"$f":"'Contacts&Annual Summary'!C8","v":2023}]
["Period (Summer or Winter)","Summer"]
["Parent fuel grade","Petrol"]
["National fuel grade"]
["Summer Period (N or A)*",0,{"$f":"IF( B8=\"A\",\"1st June to 31st August (arctic)\",\"1st May to 30th September (normal)\")","v":"1st May to 30th September (normal)"}]
["The maximum bioethanol content (% v/v)",0,"Please include the bioethanol content as a numerical figure in % V/V"]
["* N = 1st May to 30th September (normal) ; A = 1st June to 31st August (arctic)."]
[]
["Reporting results"]
[]
["Parameter","Unit","Analytical and statistical results \n(Please see an explanation and examples for new columns/ information required in Cells I15 to K37 on the Introduction & Instructions tab).",null,null,null,null,null,null,null,null,"Limiting Value (1)",null,null,null,"Test method"]
[null,null,null,null,null,null,null,null,null,null,null,"National Specification, if any",null,"According to Directive 2009/30/EC",null,"(more recent versions may also be used)"]
[null,null,"No Samples","Minimum","Maximum","Median","Mean","Standard Deviation","No Samples outside 95% tolerance limit","25% of Sample Value","75% of Sample Value","Minimum","Maximum","Minimum","Maximum","Method","Date"]
["Research Octane Number","--",0,0,0,0,0,0,0,0,0,null,null,"95 (2)",null,"EN-ISO 5164",2005]
["Motor Octane Number","--",0,0,0,0,0,0,0,0,0,null,null,"85 (3)",null,"EN-ISO 5163",2005]
["Vapour Pressure, DVPE (6)","kPa",null,null,null,null,null,null,null,null,null,null,null,null,"(4)"]
["-- required for summer period only",null,0,0,0,0,0,0,0,0,0,null,null,null,{"$f":"IF(E8=\"A\",70,60)","v":60},"EN 13106-1",2007]
["Distillation",null,null,null,null,null,null,null,null,null,null,null,null,null,null,"EN-ISO 3405"]
["-- evaporated at 100 oC","% V/V",0,0,0,0,0,0,0,0,0,null,null,46,null,null,2000]
["-- evaporated at 150 oC ","% V/V",0,0,0,0,0,0,0,0,0,null,null,75]
["Hydrocarbon analysis"]
["-- Olefins","% V/V",0,0,0,0,0,0,0,0,0,null,null,null,"18.0 (5)","ASTM D 1319\nEN 15553\nEN-ISO 22854","1995\n2007\n2008"]
["-- Aromatics","% V/V",0,0,0,0,0,0,0,0,0,null,null,null,35,"EN-ISO 22854","1995\n2008"]
["-- Benzene","% V/V",0,0,0,0,0,0,0,0,0,null,null,null,1,"EN 238\nEN 12177\nEN-ISO 22854","1996\n1998\n2008"]
[{"$f":"IF(C29>0,\"Do not complete\",\"Oxygen content\")","v":"Oxygen content"},"% (m/m)",0,0,0,0,0,0,0,0,0,null,null,null,3.7,"EN 1601\nEN 13132\nEN-ISO 22854","1997\n2000\n2008"]
[{"$f":"IF(C28>0,\"Do not complete\",\"Oxygen content*\n*petrol with 5% (v/v) or less ethanol content\")","v":"Oxygen content*\n*petrol with 5% (v/v) or less ethanol content"},"% (m/m)",0,0,0,0,0,0,0,0,0,null,null,null,2.7]
["Oxygenates"]
["-- Methanol","% V/V",0,0,0,0,0,0,0,0,0,null,null,null,3]
["-- Ethanol","% V/V",0,0,0,0,0,0,0,0,0,null,null,null,10]
["-- Iso-propyl alcohol","% V/V",0,0,0,0,0,0,0,0,0,null,null,null,12,"EN 1601",1997]
["-- Tert-butyl alcohol","% V/V",0,0,0,0,0,0,0,0,0,null,null,null,15,"EN 13132",2000]
["-- Iso-butyl alcohol","% V/V",0,0,0,0,0,0,0,0,0,null,null,null,15,"EN-ISO 22854",2008]
["-- Ethers with ≥5 carbon atoms / molecule","% V/V",0,0,0,0,0,0,0,0,0,null,null,null,22]
["-- other oxygenates","% V/V",0,0,0,0,0,0,0,0,0,null,null,null,15]
["Sulphur content","mg/kg",0,0,0,0,0,0,0,0,0,null,null,null,10,"EN-ISO 14596\nEN 24260\nEN-ISO 20846\nEN-ISO 20884","1998\n1994\n2004\n2004"]
["Lead content","g/l",0,0,0,0,0,0,0,0,0,null,null,null,5.0000000000000001E-3,"EN 237",1996]
[]
[]
["Sampling frequency"]
[]
["Number of samples in month"]
["January",0,"July",0,"(1) The limiting values are \"true values\" and were established according to the procedures for limit setting in EN 228:2008  The results of individual measurements shall be interpreted following the criteria described in EN 228:2008."]
["February",0,"August",0]
["March",0,"September",0,"(2) 91 for unleaded regular grade petrol: See 2009/30/EC Annex I, Footnote 3."]
["April",0,"October",0,"(3) 81 for unleaded regular grade petrol: See 2009/30/EC Annex I, Footnote 3."]
["May",0,"November",0,"(4) 70 kPa for Member States with arctic or severe weather conditions: See 2003/30/EC Annex I, Footnotes 4 & 5."]
["June",0,"December",0,"(5) 21 for unleaded regular grade petrol: See 98/70/EC, Annex I, Footnote 6."]
[null,null,"Summer Months Total",{"$f":"SUM(B45:B50,D45:D50)","v":0},"(6) Vapour pressure waiver applies for petrol containing Bioethanol, see 2009/30/EC Annex I, Footnote 5 and Annex III."]
[]
["Other notes (optional):"]
[]
[]
[]
["Test Methods and Analysis"]
[]
["Parameter","Unit","Test specified in 2009/30/EC or EN228:2008",null,null,null,null,null,null,"Notes on exceedences"]
[null,null,"Method","Date","Reproducability, R","Tolerance limits",null,null,null,"Sample location (S,T or R)","Values","Details/action taken"]
[null,null,null,null,null,"Minimum","Maximum","Exceeded?"]
[{"$f":"'Methods&Limits'!A9","v":"Research Octane Number (RON)"},{"$f":"'Methods&Limits'!B9","v":"--"},{"$f":"'Methods&Limits'!E9","v":"EN-ISO 5164"},{"$f":"'Methods&Limits'!F9","v":2014},{"$f":"'Methods&Limits'!G9","v":0.7},{"$f":"'Methods&Limits'!H9","v":94.587000000000003},null,{"$f":"IF(D17=\"\",\"\",IF(D17<F62,\"Yes\",\"\"))","v":"Yes"}]
[{"$f":"'Methods&Limits'!A10","v":"(RON 91 fuel only)"},{"$f":"'Methods&Limits'!B10","v":"--"},{"$f":"'Methods&Limits'!E10","v":"EN-ISO 5164"},{"$f":"'Methods&Limits'!F10","v":2014},{"$f":"'Methods&Limits'!G10","v":0.7},{"$f":"'Methods&Limits'!H10","v":90.587000000000003},null,{"$f":"IF(D17=\"\",\"\",IF(D17<F63,\"Yes\",\"\"))","v":"Yes"}]
[{"$f":"'Methods&Limits'!A11","v":"Motor Octane Number (MON)"},{"$f":"'Methods&Limits'!B11","v":"--"},{"$f":"'Methods&Limits'!E11","v":"EN-ISO 5163"},{"$f":"'Methods&Limits'!F11","v":2014},{"$f":"'Methods&Limits'!G11","v":0.9},{"$f":"'Methods&Limits'!H11","v":84.468999999999994},null,{"$f":"IF(D18=\"\",\"\",IF(D18<F64,\"Yes\",\"\"))","v":"Yes"}]
[{"$f":"'Methods&Limits'!A12","v":"(RON 91 fuel only)"},{"$f":"'Methods&Limits'!B12","v":"--"},{"$f":"'Methods&Limits'!E12","v":"EN-ISO 5163"},{"$f":"'Methods&Limits'!F12","v":2014},{"$f":"'Methods&Limits'!G12","v":0.9},{"$f":"'Methods&Limits'!H12","v":80.468999999999994},null,{"$f":"IF(D18=\"\",\"\",IF(D18<F65,\"Yes\",\"\"))","v":"Yes"}]
[{"$f":"'Methods&Limits'!A13","v":"Vapour Pressure, DVPE"}]
[{"$f":"'Methods&Limits'!A14","v":"--summer period (normal)"},{"$f":"'Methods&Limits'!B14","v":"kPa"},{"$f":"'Methods&Limits'!E14","v":"EN 13016-1"},{"$f":"'Methods&Limits'!F14","v":2018},{"$f":"'Methods&Limits'!G14","v":2.2000000000000002},null,{"$f":"'Methods&Limits'!I14","v":61.298000000000002},{"$f":"IF(E20>G67,\"Yes\",\"\")","v":""}]
[{"$f":"'Methods&Limits'!A15","v":"-- Petrol with bioethanol content 0-2"},{"$f":"'Methods&Limits'!B15","v":"kPa"},{"$f":"'Methods&Limits'!E15","v":"EN 1601"},{"$f":"'Methods&Limits'!F15","v":2017},{"$f":"'Methods&Limits'!G15","v":2.2999999999999998},null,{"$f":"'Methods&Limits'!I15","v":67.307000000000002},{"$f":"IF(E20>G68,\"Yes\",\"\")","v":""}]
[{"$f":"'Methods&Limits'!A16","v":"-- Petrol with bioethanol content 2-4"},{"$f":"'Methods&Limits'!B16","v":"kPa"},{"$f":"'Methods&Limits'!E16","v":"EN 1601"},{"$f":"'Methods&Limits'!F16","v":2017},{"$f":"'Methods&Limits'!G16","v":2.2999999999999998},null,{"$f":"'Methods&Limits'!I16","v":69.156999999999996},{"$f":"IF(E20>G69,\"Yes\",\"\")","v":""}]
[{"$f":"'Methods&Limits'!A17","v":"-- Petrol with bioethanol content 4-6"},{"$f":"'Methods&Limits'!B17","v":"kPa"},{"$f":"'Methods&Limits'!E17","v":"EN 1601"},{"$f":"'Methods&Limits'!F17","v":2017},{"$f":"'Methods&Limits'!G17","v":2.2999999999999998},null,{"$f":"'Methods&Limits'!I17","v":69.356999999999999},{"$f":"IF(E20>G70,\"Yes\",\"\")","v":""}]
[{"$f":"'Methods&Limits'!A18","v":"-- Petrol with bioethanol content 6-8"},{"$f":"'Methods&Limits'!B18","v":"kPa"},{"$f":"'Methods&Limits'!E18","v":"EN 1601"},{"$f":"'Methods&Limits'!F18","v":2017},{"$f":"'Methods&Limits'!G18","v":2.2999999999999998},null,{"$f":"'Methods&Limits'!I18","v":69.236999999999995},{"$f":"IF(E20>G71,\"Yes\",\"\")","v":""}]
[{"$f":"'Methods&Limits'!A19","v":"-- Petrol with bioethanol content 8-10"},{"$f":"'Methods&Limits'!B19","v":"kPa"},{"$f":"'Methods&Limits'!E19","v":"EN 1601"},{"$f":"'Methods&Limits'!F19","v":2017},{"$f":"'Methods&Limits'!G19","v":2.2999999999999998},null,{"$f":"'Methods&Limits'!I19","v":69.117000000000004},{"$f":"IF(E20>G72,\"Yes\",\"\")","v":""}]
[{"$f":"'Methods&Limits'!A20","v":"--summer period (arctic or severe weather conditions)"},{"$f":"'Methods&Limits'!B20","v":"kPa"},{"$f":"'Methods&Limits'!E20","v":"EN 13016-1"},{"$f":"'Methods&Limits'!F20","v":2018},{"$f":"'Methods&Limits'!G20","v":2.2999999999999998},null,{"$f":"'Methods&Limits'!I20","v":71.356999999999999},{"$f":"IF(E20>G73,\"Yes\",\"\")","v":""}]
[{"$f":"'Methods&Limits'!A21","v":"Distillation *"}]
[{"$f":"'Methods&Limits'!A22","v":"--evaporated at 100 oC"},{"$f":"'Methods&Limits'!B22","v":"% V/V"},{"$f":"'Methods&Limits'!E22","v":"EN-ISO 3405"},{"$f":"'Methods&Limits'!F22","v":2020},{"$f":"'Methods&Limits'!G22","v":4},{"$f":"'Methods&Limits'!H22","v":43.64},null,{"$f":"IF(D22=\"\",\"\",IF(D22<F75,\"Yes\",\"\"))","v":"Yes"}]
[{"$f":"'Methods&Limits'!A23","v":"-- evaporated at 150 oC "},{"$f":"'Methods&Limits'!B23","v":"% V/V"},{"$f":"'Methods&Limits'!E23","v":"EN-ISO 3405"},{"$f":"'Methods&Limits'!F23","v":2020},{"$f":"'Methods&Limits'!G23","v":4},{"$f":"'Methods&Limits'!H23","v":72.64},null,{"$f":"IF(D23=\"\",\"\",IF(D23<F76,\"Yes\",\"\"))","v":"Yes"}]
[{"$f":"'Methods&Limits'!A24","v":"Hydrocarbon analysis"},null,null,null,null,null,null,{"$f":"IF(D24<F77,\"Yes\",\"\")","v":""}]
[{"$f":"'Methods&Limits'!A25","v":"-- Olefins"},{"$f":"'Methods&Limits'!B25","v":"% V/V"},{"$f":"'Methods&Limits'!E25","v":"EN 15553"},{"$f":"'Methods&Limits'!F25","v":2021},{"$f":"'Methods&Limits'!G25","v":6.4},null,{"$f":"'Methods&Limits'!I25","v":21.776},{"$f":"IF($E$25>G78,\"Yes\",\"\")","v":""}]
[null,null,{"$f":"'Methods&Limits'!E26","v":"EN-ISO 22854"},{"$f":"'Methods&Limits'!F26","v":2021},{"$f":"'Methods&Limits'!G26","v":2.6},null,{"$f":"'Methods&Limits'!I26","v":19.533999999999999},{"$f":"IF($E$25>G79,\"Yes\",\"\")","v":""}]
[{"$f":"'Methods&Limits'!A27","v":"*without oxygenates"},null,{"$f":"'Methods&Limits'!E27","v":"EN 15553"},{"$f":"'Methods&Limits'!F27","v":2021},{"$f":"'Methods&Limits'!G27","v":"-"},null,{"$f":"'Methods&Limits'!I27","v":"-"},{"$f":"IF($E$25>G80,\"Yes\",\"\")","v":""}]
[null,null,{"$f":"'Methods&Limits'!E28","v":"EN-ISO 22854"},{"$f":"'Methods&Limits'!F28","v":2021},{"$f":"'Methods&Limits'!G28","v":"-"},null,{"$f":"'Methods&Limits'!I28","v":"-"},{"$f":"IF($E$25>G81,\"Yes\",\"\")","v":""}]
[{"$f":"'Methods&Limits'!A29","v":"-- Olefins (RON 91 fuel only)***"},{"$f":"'Methods&Limits'!B29","v":"% V/V"},{"$f":"'Methods&Limits'!E29","v":"ASTM D1319"},{"$f":"'Methods&Limits'!F29","v":2020},{"$f":"'Methods&Limits'!G29","v":5.0999999999999996},null,{"$f":"'Methods&Limits'!I29","v":24.009},{"$f":"IF($E$25>G82,\"Yes\",\"\")","v":""}]
[{"$f":"'Methods&Limits'!A30","v":"-- Aromatics (from 2005)"},null,{"$f":"'Methods&Limits'!E30","v":"EN-ISO 22854"},{"$f":"'Methods&Limits'!F30","v":2021},{"$f":"'Methods&Limits'!G30","v":1.7},null,{"$f":"'Methods&Limits'!I30","v":36.003},{"$f":"IF($E$26>G83,\"Yes\",\"\")","v":""}]
[{"$f":"'Methods&Limits'!A31","v":"-- Benzene"},{"$f":"'Methods&Limits'!B31","v":"% V/V"},{"$f":"'Methods&Limits'!E31","v":"EN 12177"},{"$f":"'Methods&Limits'!F31","v":2022},{"$f":"'Methods&Limits'!G31","v":0.1},null,{"$f":"'Methods&Limits'!I31","v":1.0589999999999999},{"$f":"IF(E27>G84,\"Yes\",\"\")","v":""}]
[null,null,{"$f":"'Methods&Limits'!E32","v":"EN 238"},{"$f":"'Methods&Limits'!F32","v":1996},{"$f":"'Methods&Limits'!G32","v":0.17},null,{"$f":"'Methods&Limits'!I32","v":1.1003000000000001},{"$f":"IF(E27>G85,\"Yes\",\"\")","v":""}]
[null,null,{"$f":"'Methods&Limits'!E33","v":"EN-ISO 22854"},{"$f":"'Methods&Limits'!F33","v":2021},{"$f":"'Methods&Limits'!G33","v":0.05},null,{"$f":"'Methods&Limits'!I33","v":1.0295000000000001},{"$f":"IF(E27>G86,\"Yes\",\"\")","v":""}]
[{"$f":"'Methods&Limits'!A34","v":"Oxygen content"},{"$f":"'Methods&Limits'!B34","v":"% (m/m)"},{"$f":"'Methods&Limits'!E34","v":"EN 1601"},{"$f":"'Methods&Limits'!F34","v":2017},{"$f":"'Methods&Limits'!G34","v":0.41},null,{"$f":"'Methods&Limits'!I34","v":3.9419},{"$f":"IF(E28>G87,\"Yes\",\"\")","v":""}]
[null,null,{"$f":"'Methods&Limits'!E35","v":"EN 1601"},{"$f":"'Methods&Limits'!F35","v":2017},{"$f":"'Methods&Limits'!G35","v":0.41},null,{"$f":"'Methods&Limits'!I35","v":2.9419},{"$f":"IF(E29>G88,\"Yes\",\"\")","v":""}]
[{"$f":"'Methods&Limits'!A36","v":"Oxygenates"}]
[{"$f":"'Methods&Limits'!A37","v":"-- Methanol"},{"$f":"'Methods&Limits'!B37","v":"% V/V"},{"$f":"'Methods&Limits'!E37","v":"EN 1601"},{"$f":"'Methods&Limits'!F37","v":2017},{"$f":"'Methods&Limits'!G37","v":0.3},null,{"$f":"'Methods&Limits'!I37","v":3.177},{"$f":"IF(E31>G90,\"Yes\",\"\")","v":""}]
[{"$f":"'Methods&Limits'!A38","v":"-- Ethanol"},{"$f":"'Methods&Limits'!B38","v":"% V/V"},{"$f":"'Methods&Limits'!E38","v":"EN 1601"},{"$f":"'Methods&Limits'!F38","v":2017},{"$f":"'Methods&Limits'!G38","v":0.8},null,{"$f":"'Methods&Limits'!I38","v":10.472},""]
[{"$f":"'Methods&Limits'!A39","v":"-- Iso-propyl alcohol"},{"$f":"'Methods&Limits'!B39","v":"% V/V"},{"$f":"'Methods&Limits'!E39","v":"EN 1601"},{"$f":"'Methods&Limits'!F39","v":2017},{"$f":"'Methods&Limits'!G39","v":0.9},null,{"$f":"'Methods&Limits'!I39","v":12.531000000000001},""]
[{"$f":"'Methods&Limits'!A40","v":"-- Tert-butyl alcohol"},{"$f":"'Methods&Limits'!B40","v":"% V/V"},{"$f":"'Methods&Limits'!E40","v":"EN 1601"},{"$f":"'Methods&Limits'!F40","v":2017},{"$f":"'Methods&Limits'!G40","v":1},null,{"$f":"'Methods&Limits'!I40","v":15.59},""]
[{"$f":"'Methods&Limits'!A41","v":"-- Iso-butyl alcohol"},{"$f":"'Methods&Limits'!B41","v":"% V/V"},{"$f":"'Methods&Limits'!E41","v":"EN 1601"},{"$f":"'Methods&Limits'!F41","v":2017},{"$f":"'Methods&Limits'!G41","v":1},null,{"$f":"'Methods&Limits'!I41","v":15.59},""]
[{"$f":"'Methods&Limits'!A42","v":"-- Ethers with 5 or more carbon atoms per molecule"},{"$f":"'Methods&Limits'!B42","v":"% V/V"},{"$f":"'Methods&Limits'!E42","v":"EN 1601"},{"$f":"'Methods&Limits'!F42","v":2017},{"$f":"'Methods&Limits'!G42","v":1},null,{"$f":"'Methods&Limits'!I42","v":22.59},""]
[{"$f":"'Methods&Limits'!A43","v":"-- other oxygenates"},{"$f":"'Methods&Limits'!B43","v":"% V/V"},{"$f":"'Methods&Limits'!E43","v":"EN 1601"},{"$f":"'Methods&Limits'!F43","v":2017},{"$f":"'Methods&Limits'!G43","v":1},null,{"$f":"'Methods&Limits'!I43","v":15.59},""]
[{"$f":"'Methods&Limits'!A44","v":"Oxygen content"},{"$f":"'Methods&Limits'!B44","v":"% (m/m)"},{"$f":"'Methods&Limits'!E44","v":"EN 13132"},{"$f":"'Methods&Limits'!F44","v":2002},{"$f":"'Methods&Limits'!G44","v":0.3},null,{"$f":"'Methods&Limits'!I44","v":3.8770000000000002},{"$f":"IF(E28>G97,\"Yes\",\"\")","v":""}]
[null,null,{"$f":"'Methods&Limits'!E45","v":"EN 13132"},{"$f":"'Methods&Limits'!F45","v":2002},{"$f":"'Methods&Limits'!G45","v":0.3},null,{"$f":"'Methods&Limits'!I45","v":2.8770000000000002},{"$f":"IF(E29>G98,\"Yes\",\"\")","v":""}]
[{"$f":"'Methods&Limits'!A46","v":"Oxygenates"}]
[{"$f":"'Methods&Limits'!A47","v":"-- Methanol"},{"$f":"'Methods&Limits'!B47","v":"% V/V"},{"$f":"'Methods&Limits'!E47","v":"EN 13132"},{"$f":"'Methods&Limits'!F47","v":2002},{"$f":"'Methods&Limits'!G47","v":0.3},null,{"$f":"'Methods&Limits'!I47","v":3.177},{"$f":"IF(E31>G100,\"Yes\",\"\")","v":""}]
[{"$f":"'Methods&Limits'!A48","v":"-- Ethanol"},{"$f":"'Methods&Limits'!B48","v":"% V/V"},{"$f":"'Methods&Limits'!E48","v":"EN 13132"},{"$f":"'Methods&Limits'!F48","v":2002},{"$f":"'Methods&Limits'!G48","v":0.8},null,{"$f":"'Methods&Limits'!I48","v":10.472},""]
[{"$f":"'Methods&Limits'!A49","v":"-- Iso-propyl alcohol"},{"$f":"'Methods&Limits'!B49","v":"% V/V"},{"$f":"'Methods&Limits'!E49","v":"EN 13132"},{"$f":"'Methods&Limits'!F49","v":2002},{"$f":"'Methods&Limits'!G49","v":0.8},null,{"$f":"'Methods&Limits'!I49","v":12.472},""]
[{"$f":"'Methods&Limits'!A50","v":"-- Tert-butyl alcohol"},{"$f":"'Methods&Limits'!B50","v":"% V/V"},{"$f":"'Methods&Limits'!E50","v":"EN 13132"},{"$f":"'Methods&Limits'!F50","v":2002},{"$f":"'Methods&Limits'!G50","v":1},null,{"$f":"'Methods&Limits'!I50","v":15.59},""]
[{"$f":"'Methods&Limits'!A51","v":"-- Iso-butyl alcohol"},{"$f":"'Methods&Limits'!B51","v":"% V/V"},{"$f":"'Methods&Limits'!E51","v":"EN 13132"},{"$f":"'Methods&Limits'!F51","v":2002},{"$f":"'Methods&Limits'!G51","v":1},null,{"$f":"'Methods&Limits'!I51","v":15.59},""]
[{"$f":"'Methods&Limits'!A52","v":"-- Ethers with 5 or more carbon atoms per molecule"},{"$f":"'Methods&Limits'!B52","v":"% V/V"},{"$f":"'Methods&Limits'!E52","v":"EN 13132"},{"$f":"'Methods&Limits'!F52","v":2002},{"$f":"'Methods&Limits'!G52","v":1},null,{"$f":"'Methods&Limits'!I52","v":22.59},""]
[{"$f":"'Methods&Limits'!A53","v":"-- other oxygenates"},{"$f":"'Methods&Limits'!B53","v":"% V/V"},{"$f":"'Methods&Limits'!E53","v":"EN 13132"},{"$f":"'Methods&Limits'!F53","v":2002},{"$f":"'Methods&Limits'!G53","v":1},null,{"$f":"'Methods&Limits'!I53","v":15.59},""]
[{"$f":"'Methods&Limits'!A54","v":"Oxygen content"},{"$f":"'Methods&Limits'!B54","v":"% (m/m)"},{"$f":"'Methods&Limits'!E54","v":"EN-ISO 22854"},{"$f":"'Methods&Limits'!F54","v":2021},{"$f":"'Methods&Limits'!G54","v":0.4},null,{"$f":"'Methods&Limits'!I54","v":3.9359999999999999},{"$f":"IF(E28>G107,\"Yes\",\"\")","v":""}]
[null,null,{"$f":"'Methods&Limits'!E55","v":"EN-ISO 22854"},{"$f":"'Methods&Limits'!F55","v":2021},{"$f":"'Methods&Limits'!G55","v":0.4},null,{"$f":"'Methods&Limits'!I55","v":2.9359999999999999},{"$f":"IF(E29>G108,\"Yes\",\"\")","v":""}]
[{"$f":"'Methods&Limits'!A56","v":"Oxyginates"}]
[{"$f":"'Methods&Limits'!A57","v":"-- Methanol"},{"$f":"'Methods&Limits'!B57","v":"% V/V"},{"$f":"'Methods&Limits'!E57","v":"EN-ISO 22854"},{"$f":"'Methods&Limits'!F57","v":2021},{"$f":"'Methods&Limits'!G57","v":0.4},null,{"$f":"'Methods&Limits'!I57","v":3.2359999999999998},{"$f":"IF(E31>G110,\"Yes\",\"\")","v":""}]
[{"$f":"'Methods&Limits'!A58","v":"-- Ethanol"},{"$f":"'Methods&Limits'!B58","v":"% V/V"},{"$f":"'Methods&Limits'!E58","v":"EN-ISO 22854"},{"$f":"'Methods&Limits'!F58","v":2021},{"$f":"'Methods&Limits'!G58","v":0.6},null,{"$f":"'Methods&Limits'!I58","v":10.353999999999999},""]
[{"$f":"'Methods&Limits'!A59","v":"-- Iso-propyl alcohol"},{"$f":"'Methods&Limits'!B59","v":"% V/V"},{"$f":"'Methods&Limits'!E59","v":"EN-ISO 22854"},{"$f":"'Methods&Limits'!F59","v":2021},{"$f":"'Methods&Limits'!G59","v":0.7},null,{"$f":"'Methods&Limits'!I59","v":12.413},""]
[{"$f":"'Methods&Limits'!A60","v":"-- Tert-butyl alcohol"},{"$f":"'Methods&Limits'!B60","v":"% V/V"},{"$f":"'Methods&Limits'!E60","v":"EN-ISO 22854"},{"$f":"'Methods&Limits'!F60","v":2021},{"$f":"'Methods&Limits'!G60","v":0.7},null,{"$f":"'Methods&Limits'!I60","v":15.413},""]
[{"$f":"'Methods&Limits'!A61","v":"-- Iso-butyl alcohol"},{"$f":"'Methods&Limits'!B61","v":"% V/V"},{"$f":"'Methods&Limits'!E61","v":"EN-ISO 22854"},{"$f":"'Methods&Limits'!F61","v":2021},{"$f":"'Methods&Limits'!G61","v":0.7},null,{"$f":"'Methods&Limits'!I61","v":15.413},""]
[{"$f":"'Methods&Limits'!A62","v":"-- Ethers with 5 or more carbon atoms per molecule"},{"$f":"'Methods&Limits'!B62","v":"% V/V"},{"$f":"'Methods&Limits'!E62","v":"EN-ISO 22854"},{"$f":"'Methods&Limits'!F62","v":2021},{"$f":"'Methods&Limits'!G62","v":0.9},null,{"$f":"'Methods&Limits'!I62","v":22.530999999999999},""]
[{"$f":"'Methods&Limits'!A63","v":"-- other oxygenates"},{"$f":"'Methods&Limits'!B63","v":"% V/V"},{"$f":"'Methods&Limits'!E63","v":"EN-ISO 22854"},{"$f":"'Methods&Limits'!F63","v":2021},{"$f":"'Methods&Limits'!G63","v":0.7},null,{"$f":"'Methods&Limits'!I63","v":15.413},""]
[{"$f":"'Methods&Limits'!A64:A64","v":"Sulphur content (sulphur free, from 2005)**"},{"$f":"'Methods&Limits'!B64","v":"mg/kg"},{"$f":"'Methods&Limits'!E64","v":"EN-ISO 14596"},{"$f":"'Methods&Limits'!F64","v":2018},{"$f":"'Methods&Limits'!G64","v":5},null,{"$f":"'Methods&Limits'!I64","v":12.95},{"$f":"IF(E$38>G117,\"Yes\",\"\")","v":""}]
[null,null,{"$f":"'Methods&Limits'!E65","v":"EN 24260"},{"$f":"'Methods&Limits'!F65","v":1994},{"$f":"'Methods&Limits'!G65","v":1},null,{"$f":"'Methods&Limits'!I65","v":10.59},{"$f":"IF(E$38>G118,\"Yes\",\"\")","v":""}]
[null,null,{"$f":"'Methods&Limits'!E66","v":"EN-ISO 20846"},{"$f":"'Methods&Limits'!F66","v":2019},{"$f":"'Methods&Limits'!G66","v":2.7},null,{"$f":"'Methods&Limits'!I66","v":11.593},{"$f":"IF(E$38>G119,\"Yes\",\"\")","v":""}]
[null,null,{"$f":"'Methods&Limits'!E67","v":"EN-ISO 20884"},{"$f":"'Methods&Limits'!F67","v":2019},{"$f":"'Methods&Limits'!G67","v":3.1},null,{"$f":"'Methods&Limits'!I67","v":11.829000000000001},{"$f":"IF(E$38>G120,\"Yes\",\"\")","v":""}]
[{"$f":"'Methods&Limits'!A68:A68","v":"Lead content"},{"$f":"'Methods&Limits'!B68","v":"g/l"},{"$f":"'Methods&Limits'!E68","v":"EN 237"},{"$f":"'Methods&Limits'!F68","v":2004},{"$f":"'Methods&Limits'!G68","v":6.1999999999999998E-3},null,{"$f":"'Methods&Limits'!I68","v":8.657999999999999E-3},{"$f":"IF($E$39>G121,\"Yes\",\"\")","v":""}]

{"sheet":"Petrol (2)","index":14,"n_rows":121,"n_cols":18,"rows_kept":121,"cut":false,"hidden":false,"merged":[[122,11,122,12],[2,6,9,16],[44,4,45,11],[46,4,46,11],[59,5,59,6],[59,9,60,9],[49,4,49,11],[50,4,50,11],[7,2,7,4],[47,4,47,11],[97,11,97,12],[87,11,87,12],[80,11,80,12],[58,2,58,8],[53,0,53,11],[2,1,2,4],[3,1,3,4],[5,1,5,4],[6,1,6,4],[4,1,4,4],[121,11,121,12],[120,11,120,12],[119,11,119,12],[118,11,118,12],[117,11,117,12],[106,11,106,12],[100,11,100,12],[99,11,99,12],[96,11,96,12],[95,11,95,12],[94,11,94,12],[93,11,93,12],[13,15,13,16],[14,11,14,12],[14,13,14,14],[14,15,14,16],[116,11,116,12],[105,11,105,12],[104,11,104,12],[103,11,103,12],[102,11,102,12],[101,11,101,12],[58,9,58,12],[13,2,14,10],[13,11,13,14],[48,4,48,11],[43,0,43,3],[86,11,86,12],[78,11,78,12],[77,11,77,12],[75,11,75,12],[74,11,74,12],[92,11,92,12],[91,11,91,12],[90,11,90,12],[89,11,89,12],[85,11,85,12],[84,11,84,12],[83,11,83,12],[82,11,82,12],[81,11,81,12],[79,11,79,12],[20,15,22,15],[67,11,67,12],[66,11,66,12],[64,11,64,12],[63,11,63,12],[27,15,28,15],[59,11,59,12],[27,16,28,16],[115,11,115,12],[114,11,114,12],[113,11,113,12],[112,11,112,12],[111,11,111,12],[110,11,110,12],[109,11,109,12],[107,11,107,12],[62,11,62,12],[71,11,71,12],[70,11,70,12],[69,11,69,12],[68,11,68,12],[61,11,61,12],[72,11,72,12]]}
["Market Fuels used in Vehicles with Spark Ignition Engines (Petrol)",null,null,null,null,null,null,null,null,null,null,null,null,null,null,null,null,"<-- GO BACK"]
[]
["Country",{"$f":"IF(LEN('Contacts&Annual Summary'!C9) > 1,'Contacts&Annual Summary'!C9,\"\")","v":""},null,null,null,null,"Notes on completing the tables\nThe table structure has been locked to prevent modification - data can be copied and pasted, in bulk into the Reporting Results blue table cells.  Where a white row exists between rows, it will not be possible to paste over white rows and sections should be pasted separately.\n\nColumn H in the Test Methods and Analysis table is set to automatically check whether the values entered in the Reporting Results table exceed maximum or minimum Tolerance Limits.  If any exceedance is detected, please provide details in the columns to the right including the number of samples, location samples were taken from, Values and Details of any action taken to address non-compliant samples.  Compliance information is verified manually and this automated compliance check is not solely relied upon during data analysis.\n\nPlease do not unlock this template - modified templates cannot be processed and may delay reporting."]
["Reporting Year",{"$f":"'Contacts&Annual Summary'!C8","v":2023}]
["Period (Summer or Winter)","Winter"]
["Parent fuel grade","Petrol"]
["National fuel grade",{"$f":"'Petrol (1)'!B7","v":0}]
["Summer Period (N or A)*",0,{"$f":"IF( B8=\"A\",\"1st June to 31st August (arctic)\",\"1st May to 30th September (normal)\")","v":"1st May to 30th September (normal)"}]
["The maximum bioethanol content (% v/v)",0,"Please include the bioethanol content as a numerical figure in % V/V"]
["* N = 1st May to 30th September (normal) ; A = 1st June to 31st August (arctic)."]
[]
["Reporting results"]
[]
["Parameter","Unit","Analytical and statistical results \n(Please see an explanation and examples for new columns/ information required in Cells I15 to K37 on the Introduction & Instructions tab).",null,null,null,null,null,null,null,null,"Limiting Value (1)",null,null,null,"Test method"]
[null,null,null,null,null,null,null,null,null,null,null,"National Specification, if any",null,"According to Directive 2009/30/EC",null,"(more recent versions may also be used)"]
[null,null,"No Samples","Minimum","Maximum","Median","Mean","Standard Deviation","No Samples outside 95% tolerance limit","25% of Sample Value","75% of Sample Value","Minimum","Maximum","Minimum","Maximum","Method","Date"]
["Research Octane Number","--",0,0,0,0,0,0,0,0,0,null,null,"95 (2)",null,"EN-ISO 5164",2005]
["Motor Octane Number","--",0,0,0,0,0,0,0,0,0,null,null,"85 (3)",null,"EN-ISO 5163",2005]
["Vapour Pressure, DVPE (6)","kPa",null,null,null,null,null,null,null,null,null,null,null,null,"(4)"]
["-- required for summer period only",null,0,0,0,0,0,0,0,0,0,null,null,null,{"$f":"IF(E8=\"A\",70,60)","v":60},"EN 13106-1",2007]
["Distillation",null,null,null,null,null,null,null,null,null,null,null,null,null,null,"EN-ISO 3405"]
["-- evaporated at 100 oC","% V/V",0,0,0,0,0,0,0,0,0,null,null,46,null,null,2000]
["-- evaporated at 150 oC ","% V/V",0,0,0,0,0,0,0,0,0,null,null,75]
["Hydrocarbon analysis"]
["-- Olefins","% V/V",0,0,0,0,0,0,0,0,0,null,null,null,"18.0 (5)","ASTM D 1319\nEN 15553\nEN-ISO 22854","1995\n2007\n2008"]
["-- Aromatics","% V/V",0,0,0,0,0,0,0,0,0,null,null,null,35,"EN-ISO 22854","1995\n2008"]
["-- Benzene","% V/V",0,0,0,0,0,0,0,0,0,null,null,null,1,"EN 238\nEN 12177\nEN-ISO 22854","1996\n1998\n2008"]
[{"$f":"IF(C29>0,\"Do not complete\",\"Oxygen content\")","v":"Oxygen content"},"% (m/m)",0,0,0,0,0,0,0,0,0,null,null,null,3.7,"EN 1601\nEN 13132\nEN-ISO 22854","1997\n2000\n2008"]
[{"$f":"IF(C28>0,\"Do not complete\",\"Oxygen content*\n*petrol with 5% (v/v) or less ethanol content\")","v":"Oxygen content*\n*petrol with 5% (v/v) or less ethanol content"},"% (m/m)",0,0,0,0,0,0,0,0,0,null,null,null,2.7]
["Oxygenates"]
["-- Methanol","% V/V",0,0,0,0,0,0,0,0,0,null,null,null,3]
["-- Ethanol","% V/V",0,0,0,0,0,0,0,0,0,null,null,null,10]
["-- Iso-propyl alcohol","% V/V",0,0,0,0,0,0,0,0,0,null,null,null,12,"EN 1601",1997]
["-- Tert-butyl alcohol","% V/V",0,0,0,0,0,0,0,0,0,null,null,null,15,"EN 13132",2000]
["-- Iso-butyl alcohol","% V/V",0,0,0,0,0,0,0,0,0,null,null,null,15,"EN-ISO 22854",2008]
["-- Ethers with ≥5 carbon atoms / molecule","% V/V",0,0,0,0,0,0,0,0,0,null,null,null,22]
["-- other oxygenates","% V/V",0,0,0,0,0,0,0,0,0,null,null,null,15]
["Sulphur content","mg/kg",0,0,0,0,0,0,0,0,0,null,null,null,10,"EN-ISO 14596\nEN 24260\nEN-ISO 20846\nEN-ISO 20884","1998\n1994\n2004\n2004"]
["Lead content","g/l",0,0,0,0,0,0,0,0,0,null,null,null,5.0000000000000001E-3,"EN 237",1996]
[]
[]
["Sampling frequency"]
[]
["Number of samples in month"]
["January",0,"July",0,"(1) The limiting values are \"true values\" and were established according to the procedures for limit setting in EN 228:2008  The results of individual measurements shall be interpreted following the criteria described in EN 228:2008."]
["February",0,"August",0]
["March",0,"September",0,"(2) 91 for unleaded regular grade petrol: See 2009/30/EC Annex I, Footnote 3."]
["April",0,"October",0,"(3) 81 for unleaded regular grade petrol: See 2009/30/EC Annex I, Footnote 3."]
["May",0,"November",0,"(4) 70 kPa for Member States with arctic or severe weather conditions: See 2003/30/EC Annex I, Footnotes 4 & 5."]
["June",0,"December",0,"(5) 21 for unleaded regular grade petrol: See 98/70/EC, Annex I, Footnote 6."]
[null,null,"Winter Months Total",{"$f":"SUM(B45:B50,D45:D50)","v":0},"(6) Vapour pressure waiver applies for petrol containing Bioethanol, see 2009/30/EC Annex I, Footnote 5 and Annex III."]
[]
["Other notes (optional):"]
[]
[]
[]
["Test Methods and Analysis"]
[]
["Parameter","Unit","Test specified in 2009/30/EC or EN228:2008",null,null,null,null,null,null,"Notes on exceedences"]
[null,null,"Method","Date","Reproducability, R","Tolerance limits",null,null,null,"Sample location (S,T or R)","Values","Details/action taken"]
[null,null,null,null,null,"Minimum","Maximum","Exceeded?"]
[{"$f":"'Methods&Limits'!A9","v":"Research Octane Number (RON)"},{"$f":"'Methods&Limits'!B9","v":"--"},{"$f":"'Methods&Limits'!E9","v":"EN-ISO 5164"},{"$f":"'Methods&Limits'!F9","v":2014},{"$f":"'Methods&Limits'!G9","v":0.7},{"$f":"'Methods&Limits'!H9","v":94.587000000000003},null,{"$f":"IF(D17=\"\",\"\",IF(D17<F62,\"Yes\",\"\"))","v":"Yes"}]
[{"$f":"'Methods&Limits'!A10","v":"(RON 91 fuel only)"},{"$f":"'Methods&Limits'!B10","v":"--"},{"$f":"'Methods&Limits'!E10","v":"EN-ISO 5164"},{"$f":"'Methods&Limits'!F10","v":2014},{"$f":"'Methods&Limits'!G10","v":0.7},{"$f":"'Methods&Limits'!H10","v":90.587000000000003},null,{"$f":"IF(D17=\"\",\"\",IF(D17<F63,\"Yes\",\"\"))","v":"Yes"}]
[{"$f":"'Methods&Limits'!A11","v":"Motor Octane Number (MON)"},{"$f":"'Methods&Limits'!B11","v":"--"},{"$f":"'Methods&Limits'!E11","v":"EN-ISO 5163"},{"$f":"'Methods&Limits'!F11","v":2014},{"$f":"'Methods&Limits'!G11","v":0.9},{"$f":"'Methods&Limits'!H11","v":84.468999999999994},null,{"$f":"IF(D18=\"\",\"\",IF(D18<F64,\"Yes\",\"\"))","v":"Yes"}]
[{"$f":"'Methods&Limits'!A12","v":"(RON 91 fuel only)"},{"$f":"'Methods&Limits'!B12","v":"--"},{"$f":"'Methods&Limits'!E12","v":"EN-ISO 5163"},{"$f":"'Methods&Limits'!F12","v":2014},{"$f":"'Methods&Limits'!G12","v":0.9},{"$f":"'Methods&Limits'!H12","v":80.468999999999994},null,{"$f":"IF(D18=\"\",\"\",IF(D18<F65,\"Yes\",\"\"))","v":"Yes"}]
[{"$f":"'Methods&Limits'!A13","v":"Vapour Pressure, DVPE"}]
[{"$f":"'Methods&Limits'!A14","v":"--summer period (normal)"},{"$f":"'Methods&Limits'!B14","v":"kPa"},{"$f":"'Methods&Limits'!E14","v":"EN 13016-1"},{"$f":"'Methods&Limits'!F14","v":2018},{"$f":"'Methods&Limits'!G14","v":2.2000000000000002},null,{"$f":"'Methods&Limits'!I14","v":61.298000000000002}]
[{"$f":"'Methods&Limits'!A15","v":"-- Petrol with bioethanol content 0-2"},{"$f":"'Methods&Limits'!B15","v":"kPa"},{"$f":"'Methods&Limits'!E15","v":"EN 1601"},{"$f":"'Methods&Limits'!F15","v":2017},{"$f":"'Methods&Limits'!G15","v":2.2999999999999998},null,{"$f":"'Methods&Limits'!I15","v":67.307000000000002}]
[{"$f":"'Methods&Limits'!A16","v":"-- Petrol with bioethanol content 2-4"},{"$f":"'Methods&Limits'!B16","v":"kPa"},{"$f":"'Methods&Limits'!E16","v":"EN 1601"},{"$f":"'Methods&Limits'!F16","v":2017},{"$f":"'Methods&Limits'!G16","v":2.2999999999999998},null,{"$f":"'Methods&Limits'!I16","v":69.156999999999996}]
[{"$f":"'Methods&Limits'!A17","v":"-- Petrol with bioethanol content 4-6"},{"$f":"'Methods&Limits'!B17","v":"kPa"},{"$f":"'Methods&Limits'!E17","v":"EN 1601"},{"$f":"'Methods&Limits'!F17","v":2017},{"$f":"'Methods&Limits'!G17","v":2.2999999999999998},null,{"$f":"'Methods&Limits'!I17","v":69.356999999999999}]
[{"$f":"'Methods&Limits'!A18","v":"-- Petrol with bioethanol content 6-8"},{"$f":"'Methods&Limits'!B18","v":"kPa"},{"$f":"'Methods&Limits'!E18","v":"EN 1601"},{"$f":"'Methods&Limits'!F18","v":2017},{"$f":"'Methods&Limits'!G18","v":2.2999999999999998},null,{"$f":"'Methods&Limits'!I18","v":69.236999999999995}]
[{"$f":"'Methods&Limits'!A19","v":"-- Petrol with bioethanol content 8-10"},{"$f":"'Methods&Limits'!B19","v":"kPa"},{"$f":"'Methods&Limits'!E19","v":"EN 1601"},{"$f":"'Methods&Limits'!F19","v":2017},{"$f":"'Methods&Limits'!G19","v":2.2999999999999998},null,{"$f":"'Methods&Limits'!I19","v":69.117000000000004}]
[{"$f":"'Methods&Limits'!A20","v":"--summer period (arctic or severe weather conditions)"},{"$f":"'Methods&Limits'!B20","v":"kPa"},{"$f":"'Methods&Limits'!E20","v":"EN 13016-1"},{"$f":"'Methods&Limits'!F20","v":2018},{"$f":"'Methods&Limits'!G20","v":2.2999999999999998},null,{"$f":"'Methods&Limits'!I20","v":71.356999999999999}]
[{"$f":"'Methods&Limits'!A21","v":"Distillation *"}]
[{"$f":"'Methods&Limits'!A22","v":"--evaporated at 100 oC"},{"$f":"'Methods&Limits'!B22","v":"% V/V"},{"$f":"'Methods&Limits'!E22","v":"EN-ISO 3405"},{"$f":"'Methods&Limits'!F22","v":2020},{"$f":"'Methods&Limits'!G22","v":4},{"$f":"'Methods&Limits'!H22","v":43.64},null,{"$f":"IF(D22=\"\",\"\",IF(D22<F75,\"Yes\",\"\"))","v":"Yes"}]
[{"$f":"'Methods&Limits'!A23","v":"-- evaporated at 150 oC "},{"$f":"'Methods&Limits'!B23","v":"% V/V"},{"$f":"'Methods&Limits'!E23","v":"EN-ISO 3405"},{"$f":"'Methods&Limits'!F23","v":2020},{"$f":"'Methods&Limits'!G23","v":4},{"$f":"'Methods&Limits'!H23","v":72.64},null,{"$f":"IF(D23=\"\",\"\",IF(D23<F76,\"Yes\",\"\"))","v":"Yes"}]
[{"$f":"'Methods&Limits'!A24","v":"Hydrocarbon analysis"},null,null,null,null,null,null,{"$f":"IF(D24<F77,\"Yes\",\"\")","v":""}]
[{"$f":"'Methods&Limits'!A25","v":"-- Olefins"},{"$f":"'Methods&Limits'!B25","v":"% V/V"},{"$f":"'Methods&Limits'!E25","v":"EN 15553"},{"$f":"'Methods&Limits'!F25","v":2021},{"$f":"'Methods&Limits'!G25","v":6.4},null,{"$f":"'Methods&Limits'!I25","v":21.776},{"$f":"IF($E$25>G78,\"Yes\",\"\")","v":""}]
[null,null,{"$f":"'Methods&Limits'!E26","v":"EN-ISO 22854"},{"$f":"'Methods&Limits'!F26","v":2021},{"$f":"'Methods&Limits'!G26","v":2.6},null,{"$f":"'Methods&Limits'!I26","v":19.533999999999999},{"$f":"IF($E$25>G79,\"Yes\",\"\")","v":""}]
[{"$f":"'Methods&Limits'!A27","v":"*without oxygenates"},null,{"$f":"'Methods&Limits'!E27","v":"EN 15553"},{"$f":"'Methods&Limits'!F27","v":2021},{"$f":"'Methods&Limits'!G27","v":"-"},null,{"$f":"'Methods&Limits'!I27","v":"-"},{"$f":"IF($E$25>G80,\"Yes\",\"\")","v":""}]
[null,null,{"$f":"'Methods&Limits'!E28","v":"EN-ISO 22854"},{"$f":"'Methods&Limits'!F28","v":2021},{"$f":"'Methods&Limits'!G28","v":"-"},null,{"$f":"'Methods&Limits'!I28","v":"-"},{"$f":"IF($E$25>G81,\"Yes\",\"\")","v":""}]
[{"$f":"'Methods&Limits'!A29","v":"-- Olefins (RON 91 fuel only)***"},{"$f":"'Methods&Limits'!B29","v":"% V/V"},{"$f":"'Methods&Limits'!E29","v":"ASTM D1319"},{"$f":"'Methods&Limits'!F29","v":2020},{"$f":"'Methods&Limits'!G29","v":5.0999999999999996},null,{"$f":"'Methods&Limits'!I29","v":24.009},{"$f":"IF($E$25>G82,\"Yes\",\"\")","v":""}]
[{"$f":"'Methods&Limits'!A30","v":"-- Aromatics (from 2005)"},null,{"$f":"'Methods&Limits'!E30","v":"EN-ISO 22854"},{"$f":"'Methods&Limits'!F30","v":2021},{"$f":"'Methods&Limits'!G30","v":1.7},null,{"$f":"'Methods&Limits'!I30","v":36.003},{"$f":"IF($E$26>G83,\"Yes\",\"\")","v":""}]
[{"$f":"'Methods&Limits'!A31","v":"-- Benzene"},{"$f":"'Methods&Limits'!B31","v":"% V/V"},{"$f":"'Methods&Limits'!E31","v":"EN 12177"},{"$f":"'Methods&Limits'!F31","v":2022},{"$f":"'Methods&Limits'!G31","v":0.1},null,{"$f":"'Methods&Limits'!I31","v":1.0589999999999999},{"$f":"IF(E27>G84,\"Yes\",\"\")","v":""}]
[null,null,{"$f":"'Methods&Limits'!E32","v":"EN 238"},{"$f":"'Methods&Limits'!F32","v":1996},{"$f":"'Methods&Limits'!G32","v":0.17},null,{"$f":"'Methods&Limits'!I32","v":1.1003000000000001},{"$f":"IF(E27>G85,\"Yes\",\"\")","v":""}]
[null,null,{"$f":"'Methods&Limits'!E33","v":"EN-ISO 22854"},{"$f":"'Methods&Limits'!F33","v":2021},{"$f":"'Methods&Limits'!G33","v":0.05},null,{"$f":"'Methods&Limits'!I33","v":1.0295000000000001},{"$f":"IF(E27>G86,\"Yes\",\"\")","v":""}]
[{"$f":"'Methods&Limits'!A34","v":"Oxygen content"},{"$f":"'Methods&Limits'!B34","v":"% (m/m)"},{"$f":"'Methods&Limits'!E34","v":"EN 1601"},{"$f":"'Methods&Limits'!F34","v":2017},{"$f":"'Methods&Limits'!G34","v":0.41},null,{"$f":"'Methods&Limits'!I34","v":3.9419},{"$f":"IF(E28>G87,\"Yes\",\"\")","v":""}]
[null,null,{"$f":"'Methods&Limits'!E35","v":"EN 1601"},{"$f":"'Methods&Limits'!F35","v":2017},{"$f":"'Methods&Limits'!G35","v":0.41},null,{"$f":"'Methods&Limits'!I35","v":2.9419},{"$f":"IF(E29>G88,\"Yes\",\"\")","v":""}]
[{"$f":"'Methods&Limits'!A36","v":"Oxygenates"}]
[{"$f":"'Methods&Limits'!A37","v":"-- Methanol"},{"$f":"'Methods&Limits'!B37","v":"% V/V"},{"$f":"'Methods&Limits'!E37","v":"EN 1601"},{"$f":"'Methods&Limits'!F37","v":2017},{"$f":"'Methods&Limits'!G37","v":0.3},null,{"$f":"'Methods&Limits'!I37","v":3.177},{"$f":"IF(E31>G90,\"Yes\",\"\")","v":""}]
[{"$f":"'Methods&Limits'!A38","v":"-- Ethanol"},{"$f":"'Methods&Limits'!B38","v":"% V/V"},{"$f":"'Methods&Limits'!E38","v":"EN 1601"},{"$f":"'Methods&Limits'!F38","v":2017},{"$f":"'Methods&Limits'!G38","v":0.8},null,{"$f":"'Methods&Limits'!I38","v":10.472},""]
[{"$f":"'Methods&Limits'!A39","v":"-- Iso-propyl alcohol"},{"$f":"'Methods&Limits'!B39","v":"% V/V"},{"$f":"'Methods&Limits'!E39","v":"EN 1601"},{"$f":"'Methods&Limits'!F39","v":2017},{"$f":"'Methods&Limits'!G39","v":0.9},null,{"$f":"'Methods&Limits'!I39","v":12.531000000000001},""]
[{"$f":"'Methods&Limits'!A40","v":"-- Tert-butyl alcohol"},{"$f":"'Methods&Limits'!B40","v":"% V/V"},{"$f":"'Methods&Limits'!E40","v":"EN 1601"},{"$f":"'Methods&Limits'!F40","v":2017},{"$f":"'Methods&Limits'!G40","v":1},null,{"$f":"'Methods&Limits'!I40","v":15.59},""]
[{"$f":"'Methods&Limits'!A41","v":"-- Iso-butyl alcohol"},{"$f":"'Methods&Limits'!B41","v":"% V/V"},{"$f":"'Methods&Limits'!E41","v":"EN 1601"},{"$f":"'Methods&Limits'!F41","v":2017},{"$f":"'Methods&Limits'!G41","v":1},null,{"$f":"'Methods&Limits'!I41","v":15.59},""]
[{"$f":"'Methods&Limits'!A42","v":"-- Ethers with 5 or more carbon atoms per molecule"},{"$f":"'Methods&Limits'!B42","v":"% V/V"},{"$f":"'Methods&Limits'!E42","v":"EN 1601"},{"$f":"'Methods&Limits'!F42","v":2017},{"$f":"'Methods&Limits'!G42","v":1},null,{"$f":"'Methods&Limits'!I42","v":22.59},""]
[{"$f":"'Methods&Limits'!A43","v":"-- other oxygenates"},{"$f":"'Methods&Limits'!B43","v":"% V/V"},{"$f":"'Methods&Limits'!E43","v":"EN 1601"},{"$f":"'Methods&Limits'!F43","v":2017},{"$f":"'Methods&Limits'!G43","v":1},null,{"$f":"'Methods&Limits'!I43","v":15.59},""]
[{"$f":"'Methods&Limits'!A44","v":"Oxygen content"},{"$f":"'Methods&Limits'!B44","v":"% (m/m)"},{"$f":"'Methods&Limits'!E44","v":"EN 13132"},{"$f":"'Methods&Limits'!F44","v":2002},{"$f":"'Methods&Limits'!G44","v":0.3},null,{"$f":"'Methods&Limits'!I44","v":3.8770000000000002},{"$f":"IF(E28>G97,\"Yes\",\"\")","v":""}]
[null,null,{"$f":"'Methods&Limits'!E45","v":"EN 13132"},{"$f":"'Methods&Limits'!F45","v":2002},{"$f":"'Methods&Limits'!G45","v":0.3},null,{"$f":"'Methods&Limits'!I45","v":2.8770000000000002},{"$f":"IF(E29>G98,\"Yes\",\"\")","v":""}]
[{"$f":"'Methods&Limits'!A46","v":"Oxygenates"}]
[{"$f":"'Methods&Limits'!A47","v":"-- Methanol"},{"$f":"'Methods&Limits'!B47","v":"% V/V"},{"$f":"'Methods&Limits'!E47","v":"EN 13132"},{"$f":"'Methods&Limits'!F47","v":2002},{"$f":"'Methods&Limits'!G47","v":0.3},null,{"$f":"'Methods&Limits'!I47","v":3.177},{"$f":"IF(E31>G100,\"Yes\",\"\")","v":""}]
[{"$f":"'Methods&Limits'!A48","v":"-- Ethanol"},{"$f":"'Methods&Limits'!B48","v":"% V/V"},{"$f":"'Methods&Limits'!E48","v":"EN 13132"},{"$f":"'Methods&Limits'!F48","v":2002},{"$f":"'Methods&Limits'!G48","v":0.8},null,{"$f":"'Methods&Limits'!I48","v":10.472},""]
[{"$f":"'Methods&Limits'!A49","v":"-- Iso-propyl alcohol"},{"$f":"'Methods&Limits'!B49","v":"% V/V"},{"$f":"'Methods&Limits'!E49","v":"EN 13132"},{"$f":"'Methods&Limits'!F49","v":2002},{"$f":"'Methods&Limits'!G49","v":0.8},null,{"$f":"'Methods&Limits'!I49","v":12.472},""]
[{"$f":"'Methods&Limits'!A50","v":"-- Tert-butyl alcohol"},{"$f":"'Methods&Limits'!B50","v":"% V/V"},{"$f":"'Methods&Limits'!E50","v":"EN 13132"},{"$f":"'Methods&Limits'!F50","v":2002},{"$f":"'Methods&Limits'!G50","v":1},null,{"$f":"'Methods&Limits'!I50","v":15.59},""]
[{"$f":"'Methods&Limits'!A51","v":"-- Iso-butyl alcohol"},{"$f":"'Methods&Limits'!B51","v":"% V/V"},{"$f":"'Methods&Limits'!E51","v":"EN 13132"},{"$f":"'Methods&Limits'!F51","v":2002},{"$f":"'Methods&Limits'!G51","v":1},null,{"$f":"'Methods&Limits'!I51","v":15.59},""]
[{"$f":"'Methods&Limits'!A52","v":"-- Ethers with 5 or more carbon atoms per molecule"},{"$f":"'Methods&Limits'!B52","v":"% V/V"},{"$f":"'Methods&Limits'!E52","v":"EN 13132"},{"$f":"'Methods&Limits'!F52","v":2002},{"$f":"'Methods&Limits'!G52","v":1},null,{"$f":"'Methods&Limits'!I52","v":22.59},""]
[{"$f":"'Methods&Limits'!A53","v":"-- other oxygenates"},{"$f":"'Methods&Limits'!B53","v":"% V/V"},{"$f":"'Methods&Limits'!E53","v":"EN 13132"},{"$f":"'Methods&Limits'!F53","v":2002},{"$f":"'Methods&Limits'!G53","v":1},null,{"$f":"'Methods&Limits'!I53","v":15.59},""]
[{"$f":"'Methods&Limits'!A54","v":"Oxygen content"},{"$f":"'Methods&Limits'!B54","v":"% (m/m)"},{"$f":"'Methods&Limits'!E54","v":"EN-ISO 22854"},{"$f":"'Methods&Limits'!F54","v":2021},{"$f":"'Methods&Limits'!G54","v":0.4},null,{"$f":"'Methods&Limits'!I54","v":3.9359999999999999},{"$f":"IF(E28>G107,\"Yes\",\"\")","v":""}]
[null,null,{"$f":"'Methods&Limits'!E55","v":"EN-ISO 22854"},{"$f":"'Methods&Limits'!F55","v":2021},{"$f":"'Methods&Limits'!G55","v":0.4},null,{"$f":"'Methods&Limits'!I55","v":2.9359999999999999},{"$f":"IF(E29>G108,\"Yes\",\"\")","v":""}]
[{"$f":"'Methods&Limits'!A56","v":"Oxyginates"}]
[{"$f":"'Methods&Limits'!A57","v":"-- Methanol"},{"$f":"'Methods&Limits'!B57","v":"% V/V"},{"$f":"'Methods&Limits'!E57","v":"EN-ISO 22854"},{"$f":"'Methods&Limits'!F57","v":2021},{"$f":"'Methods&Limits'!G57","v":0.4},null,{"$f":"'Methods&Limits'!I57","v":3.2359999999999998},{"$f":"IF(E31>G110,\"Yes\",\"\")","v":""}]
[{"$f":"'Methods&Limits'!A58","v":"-- Ethanol"},{"$f":"'Methods&Limits'!B58","v":"% V/V"},{"$f":"'Methods&Limits'!E58","v":"EN-ISO 22854"},{"$f":"'Methods&Limits'!F58","v":2021},{"$f":"'Methods&Limits'!G58","v":0.6},null,{"$f":"'Methods&Limits'!I58","v":10.353999999999999},""]
[{"$f":"'Methods&Limits'!A59","v":"-- Iso-propyl alcohol"},{"$f":"'Methods&Limits'!B59","v":"% V/V"},{"$f":"'Methods&Limits'!E59","v":"EN-ISO 22854"},{"$f":"'Methods&Limits'!F59","v":2021},{"$f":"'Methods&Limits'!G59","v":0.7},null,{"$f":"'Methods&Limits'!I59","v":12.413},""]
[{"$f":"'Methods&Limits'!A60","v":"-- Tert-butyl alcohol"},{"$f":"'Methods&Limits'!B60","v":"% V/V"},{"$f":"'Methods&Limits'!E60","v":"EN-ISO 22854"},{"$f":"'Methods&Limits'!F60","v":2021},{"$f":"'Methods&Limits'!G60","v":0.7},null,{"$f":"'Methods&Limits'!I60","v":15.413},""]
[{"$f":"'Methods&Limits'!A61","v":"-- Iso-butyl alcohol"},{"$f":"'Methods&Limits'!B61","v":"% V/V"},{"$f":"'Methods&Limits'!E61","v":"EN-ISO 22854"},{"$f":"'Methods&Limits'!F61","v":2021},{"$f":"'Methods&Limits'!G61","v":0.7},null,{"$f":"'Methods&Limits'!I61","v":15.413},""]
[{"$f":"'Methods&Limits'!A62","v":"-- Ethers with 5 or more carbon atoms per molecule"},{"$f":"'Methods&Limits'!B62","v":"% V/V"},{"$f":"'Methods&Limits'!E62","v":"EN-ISO 22854"},{"$f":"'Methods&Limits'!F62","v":2021},{"$f":"'Methods&Limits'!G62","v":0.9},null,{"$f":"'Methods&Limits'!I62","v":22.530999999999999},""]
[{"$f":"'Methods&Limits'!A63","v":"-- other oxygenates"},{"$f":"'Methods&Limits'!B63","v":"% V/V"},{"$f":"'Methods&Limits'!E63","v":"EN-ISO 22854"},{"$f":"'Methods&Limits'!F63","v":2021},{"$f":"'Methods&Limits'!G63","v":0.7},null,{"$f":"'Methods&Limits'!I63","v":15.413},""]
[{"$f":"'Methods&Limits'!A64:A64","v":"Sulphur content (sulphur free, from 2005)**"},{"$f":"'Methods&Limits'!B64","v":"mg/kg"},{"$f":"'Methods&Limits'!E64","v":"EN-ISO 14596"},{"$f":"'Methods&Limits'!F64","v":2018},{"$f":"'Methods&Limits'!G64","v":5},null,{"$f":"'Methods&Limits'!I64","v":12.95},{"$f":"IF(E$38>G117,\"Yes\",\"\")","v":""}]
[null,null,{"$f":"'Methods&Limits'!E65","v":"EN 24260"},{"$f":"'Methods&Limits'!F65","v":1994},{"$f":"'Methods&Limits'!G65","v":1},null,{"$f":"'Methods&Limits'!I65","v":10.59},{"$f":"IF(E$38>G118,\"Yes\",\"\")","v":""}]
[null,null,{"$f":"'Methods&Limits'!E66","v":"EN-ISO 20846"},{"$f":"'Methods&Limits'!F66","v":2019},{"$f":"'Methods&Limits'!G66","v":2.7},null,{"$f":"'Methods&Limits'!I66","v":11.593},{"$f":"IF(E$38>G119,\"Yes\",\"\")","v":""}]
[null,null,{"$f":"'Methods&Limits'!E67","v":"EN-ISO 20884"},{"$f":"'Methods&Limits'!F67","v":2019},{"$f":"'Methods&Limits'!G67","v":3.1},null,{"$f":"'Methods&Limits'!I67","v":11.829000000000001},{"$f":"IF(E$38>G120,\"Yes\",\"\")","v":""}]
[{"$f":"'Methods&Limits'!A68:A68","v":"Lead content"},{"$f":"'Methods&Limits'!B68","v":"g/l"},{"$f":"'Methods&Limits'!E68","v":"EN 237"},{"$f":"'Methods&Limits'!F68","v":2004},{"$f":"'Methods&Limits'!G68","v":6.1999999999999998E-3},null,{"$f":"'Methods&Limits'!I68","v":8.657999999999999E-3},{"$f":"IF($E$39>G121,\"Yes\",\"\")","v":""}]

{"sheet":"Petrol (1+2)","index":15,"n_rows":121,"n_cols":18,"rows_kept":121,"cut":false,"hidden":false,"merged":[[122,11,122,12],[59,5,59,6],[59,9,60,9],[104,11,104,12],[103,11,103,12],[102,11,102,12],[101,11,101,12],[100,11,100,12],[99,11,99,12],[96,11,96,12],[121,11,121,12],[120,11,120,12],[119,11,119,12],[118,11,118,12],[117,11,117,12],[116,11,116,12],[43,0,43,3],[48,4,48,11],[53,0,53,11],[58,2,58,8],[58,9,58,12],[49,4,49,11],[47,4,47,11],[3,1,3,4],[5,1,5,4],[6,1,6,4],[4,1,4,4],[14,15,14,16],[13,2,14,10],[13,11,13,14],[13,15,13,16],[2,6,9,16],[14,13,14,14],[7,2,7,4],[2,1,2,4],[105,11,105,12],[106,11,106,12],[44,4,45,11],[46,4,46,11],[14,11,14,12],[84,11,84,12],[95,11,95,12],[94,11,94,12],[93,11,93,12],[97,11,97,12],[92,11,92,12],[91,11,91,12],[90,11,90,12],[89,11,89,12],[86,11,86,12],[85,11,85,12],[72,11,72,12],[71,11,71,12],[70,11,70,12],[83,11,83,12],[82,11,82,12],[81,11,81,12],[79,11,79,12],[78,11,78,12],[80,11,80,12],[20,15,22,15],[68,11,68,12],[67,11,67,12],[66,11,66,12],[64,11,64,12],[63,11,63,12],[50,4,50,11],[27,15,28,15],[59,11,59,12],[27,16,28,16],[115,11,115,12],[114,11,114,12],[113,11,113,12],[112,11,112,12],[111,11,111,12],[110,11,110,12],[109,11,109,12],[107,11,107,12],[69,11,69,12],[62,11,62,12],[61,11,61,12],[77,11,77,12],[75,11,75,12],[74,11,74,12],[87,11,87,12]]}
["Market Fuels used in Vehicles with Spark Ignition Engines (Petrol)",null,null,null,null,null,null,null,null,null,null,null,null,null,null,null,null,"<-- GO BACK"]
[]
["Country",{"$f":"IF(LEN('Contacts&Annual Summary'!C9) > 1,'Contacts&Annual Summary'!C9,\"\")","v":""},null,null,null,null,"Notes on completing the tables\nThe table structure has been locked to prevent modification - data can be copied and pasted, in bulk into the Reporting Results blue table cells.  Where a white row exists between rows, it will not be possible to paste over white rows and sections should be pasted separately.\n\nColumn H in the Test Methods and Analysis table is set to automatically check whether the values entered in the Reporting Results table exceed maximum or minimum Tolerance Limits.  If any exceedance is detected, please provide details in the columns to the right including the number of samples, location samples were taken from, Values and Details of any action taken to address non-compliant samples.  Compliance information is verified manually and this automated compliance check is not solely relied upon during data analysis.\n\nPlease do not unlock this template - modified templates cannot be processed and may delay reporting."]
["Reporting Year",{"$f":"'Contacts&Annual Summary'!C8","v":2023}]
["Period (Summer or Winter)","Full Year"]
["Parent fuel grade","Petrol"]
["National fuel grade",{"$f":"'Petrol (1)'!B7","v":0}]
["Summer Period (N or A)*",0,{"$f":"IF( B8=\"A\",\"1st June to 31st August (arctic)\",\"1st May to 30th September (normal)\")","v":"1st May to 30th September (normal)"}]
["The maximum bioethanol content (% v/v)",{"$f":"MAX('Petrol (1)'!B9,'Petrol (2)'!B9)","v":0},"Please include the bioethanol content as a numerical figure in % V/V"]
["* N = 1st May to 30th September (normal) ; A = 1st June to 31st August (arctic)."]
[]
["Reporting results"]
[]
["Parameter","Unit","Analytical and statistical results \n(Please see an explanation and examples for new columns/ information required in Cells I15 to K37 on the Introduction & Instructions tab).",null,null,null,null,null,null,null,null,"Limiting Value (1)",null,null,null,"Test method"]
[null,null,null,null,null,null,null,null,null,null,null,"National Specification, if any",null,"According to Directive 2009/30/EC",null,"(more recent versions may also be used)"]
[null,null,"No Samples","Minimum","Maximum","Median","Mean","Standard Deviation","No Samples outside 95% tolerance limit","25% of Sample Value","75% of Sample Value","Minimum","Maximum","Minimum","Maximum","Method","Date"]
["Research Octane Number","--",{"$f":"IF(AND('Petrol (1)'!C17=\"\",'Petrol (2)'!C17=\"\"),\"\",'Petrol (1)'!C17+'Petrol (2)'!C17)","v":0},{"$f":"IF(AND('Petrol (1)'!D17=\"\",'Petrol (2)'!D17=\"\"),\"\",MIN('Petrol (1)'!D17,'Petrol (2)'!D17))","v":0},{"$f":"IF(AND('Petrol (1)'!E17=\"\",'Petrol (2)'!E17=\"\"),\"\",MAX('Petrol (1)'!E17,'Petrol (2)'!E17))","v":0},0,0,0,{"$f":"IF(AND('Petrol (1)'!I17=\"\",'Petrol (2)'!I17=\"\"),\"\",'Petrol (1)'!I17+'Petrol (2)'!I17)","v":0},0,0,null,null,"95 (2)",null,"EN-ISO 5164",2005]
["Motor Octane Number","--",{"$f":"IF(AND('Petrol (1)'!C18=\"\",'Petrol (2)'!C18=\"\"),\"\",'Petrol (1)'!C18+'Petrol (2)'!C18)","v":0},{"$f":"IF(AND('Petrol (1)'!D18=\"\",'Petrol (2)'!D18=\"\"),\"\",MIN('Petrol (1)'!D18,'Petrol (2)'!D18))","v":0},{"$f":"IF(AND('Petrol (1)'!E18=\"\",'Petrol (2)'!E18=\"\"),\"\",MAX('Petrol (1)'!E18,'Petrol (2)'!E18))","v":0},0,0,0,{"$f":"IF(AND('Petrol (1)'!I18=\"\",'Petrol (2)'!I18=\"\"),\"\",'Petrol (1)'!I18+'Petrol (2)'!I18)","v":0},0,0,null,null,"85 (3)",null,"EN-ISO 5163",2005]
["Vapour Pressure, DVPE (6)","kPa",null,null,null,null,null,null,null,null,null,null,null,null,"(4)"]
["-- required for summer period only",null,{"$f":"IF(AND('Petrol (1)'!C20=\"\",'Petrol (2)'!C20=\"\"),\"\",'Petrol (1)'!C20+'Petrol (2)'!C20)","v":0},{"$f":"IF(AND('Petrol (1)'!D20=\"\",'Petrol (2)'!D20=\"\"),\"\",MIN('Petrol (1)'!D20,'Petrol (2)'!D20))","v":0},{"$f":"IF(AND('Petrol (1)'!E20=\"\",'Petrol (2)'!E20=\"\"),\"\",MAX('Petrol (1)'!E20,'Petrol (2)'!E20))","v":0},0,0,0,{"$f":"IF(AND('Petrol (1)'!I20=\"\",'Petrol (2)'!I20=\"\"),\"\",'Petrol (1)'!I20+'Petrol (2)'!I20)","v":0},0,0,null,null,null,{"$f":"IF(E8=\"A\",70,60)","v":60},"EN 13106-1",2007]
["Distillation",null,null,null,null,null,null,null,null,null,null,null,null,null,null,"EN-ISO 3405"]
["-- evaporated at 100 oC","% V/V",{"$f":"IF(AND('Petrol (1)'!C22=\"\",'Petrol (2)'!C22=\"\"),\"\",'Petrol (1)'!C22+'Petrol (2)'!C22)","v":0},{"$f":"IF(AND('Petrol (1)'!D22=\"\",'Petrol (2)'!D22=\"\"),\"\",MIN('Petrol (1)'!D22,'Petrol (2)'!D22))","v":0},{"$f":"IF(AND('Petrol (1)'!E22=\"\",'Petrol (2)'!E22=\"\"),\"\",MAX('Petrol (1)'!E22,'Petrol (2)'!E22))","v":0},0,0,0,{"$f":"IF(AND('Petrol (1)'!I22=\"\",'Petrol (2)'!I22=\"\"),\"\",'Petrol (1)'!I22+'Petrol (2)'!I22)","v":0},0,0,null,null,46,null,null,2000]
["-- evaporated at 150 oC ","% V/V",{"$f":"IF(AND('Petrol (1)'!C23=\"\",'Petrol (2)'!C23=\"\"),\"\",'Petrol (1)'!C23+'Petrol (2)'!C23)","v":0},{"$f":"IF(AND('Petrol (1)'!D23=\"\",'Petrol (2)'!D23=\"\"),\"\",MIN('Petrol (1)'!D23,'Petrol (2)'!D23))","v":0},{"$f":"IF(AND('Petrol (1)'!E23=\"\",'Petrol (2)'!E23=\"\"),\"\",MAX('Petrol (1)'!E23,'Petrol (2)'!E23))","v":0},0,0,0,{"$f":"IF(AND('Petrol (1)'!I23=\"\",'Petrol (2)'!I23=\"\"),\"\",'Petrol (1)'!I23+'Petrol (2)'!I23)","v":0},0,0,null,null,75]
["Hydrocarbon analysis"]
["-- Olefins","% V/V",{"$f":"IF(AND('Petrol (1)'!C25=\"\",'Petrol (2)'!C25=\"\"),\"\",'Petrol (1)'!C25+'Petrol (2)'!C25)","v":0},{"$f":"IF(AND('Petrol (1)'!D25=\"\",'Petrol (2)'!D25=\"\"),\"\",MIN('Petrol (1)'!D25,'Petrol (2)'!D25))","v":0},{"$f":"IF(AND('Petrol (1)'!E25=\"\",'Petrol (2)'!E25=\"\"),\"\",MAX('Petrol (1)'!E25,'Petrol (2)'!E25))","v":0},0,0,0,{"$f":"IF(AND('Petrol (1)'!I25=\"\",'Petrol (2)'!I25=\"\"),\"\",'Petrol (1)'!I25+'Petrol (2)'!I25)","v":0},0,0,null,null,null,"18.0 (5)","ASTM D 1319\nEN 15553\nEN-ISO 22854","1995\n2007\n2008"]
["-- Aromatics","% V/V",{"$f":"IF(AND('Petrol (1)'!C26=\"\",'Petrol (2)'!C26=\"\"),\"\",'Petrol (1)'!C26+'Petrol (2)'!C26)","v":0},{"$f":"IF(AND('Petrol (1)'!D26=\"\",'Petrol (2)'!D26=\"\"),\"\",MIN('Petrol (1)'!D26,'Petrol (2)'!D26))","v":0},{"$f":"IF(AND('Petrol (1)'!E26=\"\",'Petrol (2)'!E26=\"\"),\"\",MAX('Petrol (1)'!E26,'Petrol (2)'!E26))","v":0},0,0,0,{"$f":"IF(AND('Petrol (1)'!I26=\"\",'Petrol (2)'!I26=\"\"),\"\",'Petrol (1)'!I26+'Petrol (2)'!I26)","v":0},0,0,null,null,null,35,"EN-ISO 22854","1995\n2008"]
["-- Benzene","% V/V",{"$f":"IF(AND('Petrol (1)'!C27=\"\",'Petrol (2)'!C27=\"\"),\"\",'Petrol (1)'!C27+'Petrol (2)'!C27)","v":0},{"$f":"IF(AND('Petrol (1)'!D27=\"\",'Petrol (2)'!D27=\"\"),\"\",MIN('Petrol (1)'!D27,'Petrol (2)'!D27))","v":0},{"$f":"IF(AND('Petrol (1)'!E27=\"\",'Petrol (2)'!E27=\"\"),\"\",MAX('Petrol (1)'!E27,'Petrol (2)'!E27))","v":0},0,0,0,{"$f":"IF(AND('Petrol (1)'!I27=\"\",'Petrol (2)'!I27=\"\"),\"\",'Petrol (1)'!I27+'Petrol (2)'!I27)","v":0},0,0,null,null,null,1,"EN 238\nEN 12177\nEN-ISO 22854","1996\n1998\n2008"]
[{"$f":"IF(C29>0,\"Do not complete\",\"Oxygen content\")","v":"Oxygen content"},"% (m/m)",{"$f":"IF(AND('Petrol (1)'!C28=\"\",'Petrol (2)'!C28=\"\"),\"\",'Petrol (1)'!C28+'Petrol (2)'!C28)","v":0},{"$f":"IF(AND('Petrol (1)'!D28=\"\",'Petrol (2)'!D28=\"\"),\"\",MIN('Petrol (1)'!D28,'Petrol (2)'!D28))","v":0},{"$f":"IF(AND('Petrol (1)'!E28=\"\",'Petrol (2)'!E28=\"\"),\"\",MAX('Petrol (1)'!E28,'Petrol (2)'!E28))","v":0},0,0,0,{"$f":"IF(AND('Petrol (1)'!I28=\"\",'Petrol (2)'!I28=\"\"),\"\",'Petrol (1)'!I28+'Petrol (2)'!I28)","v":0},0,0,null,null,null,3.7,"EN 1601\nEN 13132\nEN-ISO 22854","1997\n2000\n2008"]
[{"$f":"IF(C28>0,\"Do not complete\",\"Oxygen content*\n*petrol with 5% (v/v) or less ethanol content\")","v":"Oxygen content*\n*petrol with 5% (v/v) or less ethanol content"},"% (m/m)",{"$f":"IF(AND('Petrol (1)'!C29=\"\",'Petrol (2)'!C29=\"\"),\"\",'Petrol (1)'!C29+'Petrol (2)'!C29)","v":0},{"$f":"IF(AND('Petrol (1)'!D29=\"\",'Petrol (2)'!D29=\"\"),\"\",MIN('Petrol (1)'!D29,'Petrol (2)'!D29))","v":0},{"$f":"IF(AND('Petrol (1)'!E29=\"\",'Petrol (2)'!E29=\"\"),\"\",MAX('Petrol (1)'!E29,'Petrol (2)'!E29))","v":0},0,0,0,{"$f":"IF(AND('Petrol (1)'!I29=\"\",'Petrol (2)'!I29=\"\"),\"\",'Petrol (1)'!I29+'Petrol (2)'!I29)","v":0},0,0,null,null,null,2.7]
["Oxygenates"]
["-- Methanol","% V/V",{"$f":"IF(AND('Petrol (1)'!C31=\"\",'Petrol (2)'!C31=\"\"),\"\",'Petrol (1)'!C31+'Petrol (2)'!C31)","v":0},{"$f":"IF(AND('Petrol (1)'!D31=\"\",'Petrol (2)'!D31=\"\"),\"\",MIN('Petrol (1)'!D31,'Petrol (2)'!D31))","v":0},{"$f":"IF(AND('Petrol (1)'!E31=\"\",'Petrol (2)'!E31=\"\"),\"\",MAX('Petrol (1)'!E31,'Petrol (2)'!E31))","v":0},0,0,0,{"$f":"IF(AND('Petrol (1)'!I31=\"\",'Petrol (2)'!I31=\"\"),\"\",'Petrol (1)'!I31+'Petrol (2)'!I31)","v":0},0,0,null,null,null,3]
["-- Ethanol","% V/V",{"$f":"IF(AND('Petrol (1)'!C32=\"\",'Petrol (2)'!C32=\"\"),\"\",'Petrol (1)'!C32+'Petrol (2)'!C32)","v":0},{"$f":"IF(AND('Petrol (1)'!D32=\"\",'Petrol (2)'!D32=\"\"),\"\",MIN('Petrol (1)'!D32,'Petrol (2)'!D32))","v":0},{"$f":"IF(AND('Petrol (1)'!E32=\"\",'Petrol (2)'!E32=\"\"),\"\",MAX('Petrol (1)'!E32,'Petrol (2)'!E32))","v":0},0,0,0,{"$f":"IF(AND('Petrol (1)'!I32=\"\",'Petrol (2)'!I32=\"\"),\"\",'Petrol (1)'!I32+'Petrol (2)'!I32)","v":0},0,0,null,null,null,10]
["-- Iso-propyl alcohol","% V/V",{"$f":"IF(AND('Petrol (1)'!C33=\"\",'Petrol (2)'!C33=\"\"),\"\",'Petrol (1)'!C33+'Petrol (2)'!C33)","v":0},{"$f":"IF(AND('Petrol (1)'!D33=\"\",'Petrol (2)'!D33=\"\"),\"\",MIN('Petrol (1)'!D33,'Petrol (2)'!D33))","v":0},{"$f":"IF(AND('Petrol (1)'!E33=\"\",'Petrol (2)'!E33=\"\"),\"\",MAX('Petrol (1)'!E33,'Petrol (2)'!E33))","v":0},0,0,0,{"$f":"IF(AND('Petrol (1)'!I33=\"\",'Petrol (2)'!I33=\"\"),\"\",'Petrol (1)'!I33+'Petrol (2)'!I33)","v":0},0,0,null,null,null,12,"EN 1601",1997]
["-- Tert-butyl alcohol","% V/V",{"$f":"IF(AND('Petrol (1)'!C34=\"\",'Petrol (2)'!C34=\"\"),\"\",'Petrol (1)'!C34+'Petrol (2)'!C34)","v":0},{"$f":"IF(AND('Petrol (1)'!D34=\"\",'Petrol (2)'!D34=\"\"),\"\",MIN('Petrol (1)'!D34,'Petrol (2)'!D34))","v":0},{"$f":"IF(AND('Petrol (1)'!E34=\"\",'Petrol (2)'!E34=\"\"),\"\",MAX('Petrol (1)'!E34,'Petrol (2)'!E34))","v":0},0,0,0,{"$f":"IF(AND('Petrol (1)'!I34=\"\",'Petrol (2)'!I34=\"\"),\"\",'Petrol (1)'!I34+'Petrol (2)'!I34)","v":0},0,0,null,null,null,15,"EN 13132",2000]
["-- Iso-butyl alcohol","% V/V",{"$f":"IF(AND('Petrol (1)'!C35=\"\",'Petrol (2)'!C35=\"\"),\"\",'Petrol (1)'!C35+'Petrol (2)'!C35)","v":0},{"$f":"IF(AND('Petrol (1)'!D35=\"\",'Petrol (2)'!D35=\"\"),\"\",MIN('Petrol (1)'!D35,'Petrol (2)'!D35))","v":0},{"$f":"IF(AND('Petrol (1)'!E35=\"\",'Petrol (2)'!E35=\"\"),\"\",MAX('Petrol (1)'!E35,'Petrol (2)'!E35))","v":0},0,0,0,{"$f":"IF(AND('Petrol (1)'!I35=\"\",'Petrol (2)'!I35=\"\"),\"\",'Petrol (1)'!I35+'Petrol (2)'!I35)","v":0},0,0,null,null,null,15,"EN-ISO 22854",2008]
["-- Ethers with ≥5 carbon atoms / molecule","% V/V",{"$f":"IF(AND('Petrol (1)'!C36=\"\",'Petrol (2)'!C36=\"\"),\"\",'Petrol (1)'!C36+'Petrol (2)'!C36)","v":0},{"$f":"IF(AND('Petrol (1)'!D36=\"\",'Petrol (2)'!D36=\"\"),\"\",MIN('Petrol (1)'!D36,'Petrol (2)'!D36))","v":0},{"$f":"IF(AND('Petrol (1)'!E36=\"\",'Petrol (2)'!E36=\"\"),\"\",MAX('Petrol (1)'!E36,'Petrol (2)'!E36))","v":0},0,0,0,{"$f":"IF(AND('Petrol (1)'!I36=\"\",'Petrol (2)'!I36=\"\"),\"\",'Petrol (1)'!I36+'Petrol (2)'!I36)","v":0},0,0,null,null,null,22]
["-- other oxygenates","% V/V",{"$f":"IF(AND('Petrol (1)'!C37=\"\",'Petrol (2)'!C37=\"\"),\"\",'Petrol (1)'!C37+'Petrol (2)'!C37)","v":0},{"$f":"IF(AND('Petrol (1)'!D37=\"\",'Petrol (2)'!D37=\"\"),\"\",MIN('Petrol (1)'!D37,'Petrol (2)'!D37))","v":0},{"$f":"IF(AND('Petrol (1)'!E37=\"\",'Petrol (2)'!E37=\"\"),\"\",MAX('Petrol (1)'!E37,'Petrol (2)'!E37))","v":0},0,0,0,{"$f":"IF(AND('Petrol (1)'!I37=\"\",'Petrol (2)'!I37=\"\"),\"\",'Petrol (1)'!I37+'Petrol (2)'!I37)","v":0},0,0,null,null,null,15]
["Sulphur content","mg/kg",{"$f":"IF(AND('Petrol (1)'!C38=\"\",'Petrol (2)'!C38=\"\"),\"\",'Petrol (1)'!C38+'Petrol (2)'!C38)","v":0},{"$f":"IF(AND('Petrol (1)'!D38=\"\",'Petrol (2)'!D38=\"\"),\"\",MIN('Petrol (1)'!D38,'Petrol (2)'!D38))","v":0},{"$f":"IF(AND('Petrol (1)'!E38=\"\",'Petrol (2)'!E38=\"\"),\"\",MAX('Petrol (1)'!E38,'Petrol (2)'!E38))","v":0},0,0,0,{"$f":"IF(AND('Petrol (1)'!I38=\"\",'Petrol (2)'!I38=\"\"),\"\",'Petrol (1)'!I38+'Petrol (2)'!I38)","v":0},0,0,null,null,null,10,"EN-ISO 14596\nEN 24260\nEN-ISO 20846\nEN-ISO 20884","1998\n1994\n2004\n2004"]
["Lead content","g/l",{"$f":"IF(AND('Petrol (1)'!C39=\"\",'Petrol (2)'!C39=\"\"),\"\",'Petrol (1)'!C39+'Petrol (2)'!C39)","v":0},{"$f":"IF(AND('Petrol (1)'!D39=\"\",'Petrol (2)'!D39=\"\"),\"\",MIN('Petrol (1)'!D39,'Petrol (2)'!D39))","v":0},{"$f":"IF(AND('Petrol (1)'!E39=\"\",'Petrol (2)'!E39=\"\"),\"\",MAX('Petrol (1)'!E39,'Petrol (2)'!E39))","v":0},0,0,0,{"$f":"IF(AND('Petrol (1)'!I39=\"\",'Petrol (2)'!I39=\"\"),\"\",'Petrol (1)'!I39+'Petrol (2)'!I39)","v":0},0,0,null,null,null,5.0000000000000001E-3,"EN 237",1996]
[]
[]
["Sampling frequency"]
[]
["Number of samples in month"]
["January",{"$f":"'Petrol (1)'!B45+'Petrol (2)'!B45","v":0},"July",{"$f":"'Petrol (1)'!D45+'Petrol (2)'!D45","v":0},"(1) The limiting values are \"true values\" and were established according to the procedures for limit setting in EN 228:2008  The results of individual measurements shall be interpreted following the criteria described in EN 228:2008."]
["February",{"$f":"'Petrol (1)'!B46+'Petrol (2)'!B46","v":0},"August",{"$f":"'Petrol (1)'!D46+'Petrol (2)'!D46","v":0}]
["March",{"$f":"'Petrol (1)'!B47+'Petrol (2)'!B47","v":0},"September",{"$f":"'Petrol (1)'!D47+'Petrol (2)'!D47","v":0},"(2) 91 for unleaded regular grade petrol: See 2009/30/EC Annex I, Footnote 3."]
["April",{"$f":"'Petrol (1)'!B48+'Petrol (2)'!B48","v":0},"October",{"$f":"'Petrol (1)'!D48+'Petrol (2)'!D48","v":0},"(3) 81 for unleaded regular grade petrol: See 2009/30/EC Annex I, Footnote 3."]
["May",{"$f":"'Petrol (1)'!B49+'Petrol (2)'!B49","v":0},"November",{"$f":"'Petrol (1)'!D49+'Petrol (2)'!D49","v":0},"(4) 70 kPa for Member States with arctic or severe weather conditions: See 2003/30/EC Annex I, Footnotes 4 & 5."]
["June",{"$f":"'Petrol (1)'!B50+'Petrol (2)'!B50","v":0},"December",{"$f":"'Petrol (1)'!D50+'Petrol (2)'!D50","v":0},"(5) 21 for unleaded regular grade petrol: See 98/70/EC, Annex I, Footnote 6."]
[null,null,"Full Year Total",{"$f":"SUM(B45:B50,D45:D50)","v":0},"(6) Vapour pressure waiver applies for petrol containing Bioethanol, see 2009/30/EC Annex I, Footnote 5 and Annex III."]
[]
["Other notes (optional):"]
[]
[]
[]
["Test Methods and Analysis",null,null,null,null,null,null,null,"Only if not provided in Summer and Winter sheets"]
[]
["Parameter","Unit","Test specified in 2009/30/EC or EN228:2008",null,null,null,null,null,null,"Notes on exceedences"]
[null,null,"Method","Date","Reproducability, R","Tolerance limits",null,null,null,"Sample location (S,T or R)","Values","Details/action taken"]
[null,null,null,null,null,"Minimum","Maximum","Exceeded?"]
[{"$f":"'Methods&Limits'!A9","v":"Research Octane Number (RON)"},{"$f":"'Methods&Limits'!B9","v":"--"},{"$f":"'Methods&Limits'!E9","v":"EN-ISO 5164"},{"$f":"'Methods&Limits'!F9","v":2014},{"$f":"'Methods&Limits'!G9","v":0.7},{"$f":"'Methods&Limits'!H9","v":94.587000000000003},null,{"$f":"IF(D17=\"\",\"\",IF(D17<F62,\"Yes\",\"\"))","v":"Yes"}]
[{"$f":"'Methods&Limits'!A10","v":"(RON 91 fuel only)"},{"$f":"'Methods&Limits'!B10","v":"--"},{"$f":"'Methods&Limits'!E10","v":"EN-ISO 5164"},{"$f":"'Methods&Limits'!F10","v":2014},{"$f":"'Methods&Limits'!G10","v":0.7},{"$f":"'Methods&Limits'!H10","v":90.587000000000003},null,{"$f":"IF(D17=\"\",\"\",IF(D17<F63,\"Yes\",\"\"))","v":"Yes"}]
[{"$f":"'Methods&Limits'!A11","v":"Motor Octane Number (MON)"},{"$f":"'Methods&Limits'!B11","v":"--"},{"$f":"'Methods&Limits'!E11","v":"EN-ISO 5163"},{"$f":"'Methods&Limits'!F11","v":2014},{"$f":"'Methods&Limits'!G11","v":0.9},{"$f":"'Methods&Limits'!H11","v":84.468999999999994},null,{"$f":"IF(D18=\"\",\"\",IF(D18<F64,\"Yes\",\"\"))","v":"Yes"}]
[{"$f":"'Methods&Limits'!A12","v":"(RON 91 fuel only)"},{"$f":"'Methods&Limits'!B12","v":"--"},{"$f":"'Methods&Limits'!E12","v":"EN-ISO 5163"},{"$f":"'Methods&Limits'!F12","v":2014},{"$f":"'Methods&Limits'!G12","v":0.9},{"$f":"'Methods&Limits'!H12","v":80.468999999999994},null,{"$f":"IF(D18=\"\",\"\",IF(D18<F65,\"Yes\",\"\"))","v":"Yes"}]
[{"$f":"'Methods&Limits'!A13","v":"Vapour Pressure, DVPE"}]
[{"$f":"'Methods&Limits'!A14","v":"--summer period (normal)"},{"$f":"'Methods&Limits'!B14","v":"kPa"},{"$f":"'Methods&Limits'!E14","v":"EN 13016-1"},{"$f":"'Methods&Limits'!F14","v":2018},{"$f":"'Methods&Limits'!G14","v":2.2000000000000002},null,{"$f":"'Methods&Limits'!I14","v":61.298000000000002},{"$f":"IF(E$20=\"\",\"\",IF(E$20>G67,\"Yes\",\"\"))","v":""}]
[{"$f":"'Methods&Limits'!A15","v":"-- Petrol with bioethanol content 0-2"},{"$f":"'Methods&Limits'!B15","v":"kPa"},{"$f":"'Methods&Limits'!E15","v":"EN 1601"},{"$f":"'Methods&Limits'!F15","v":2017},{"$f":"'Methods&Limits'!G15","v":2.2999999999999998},null,{"$f":"'Methods&Limits'!I15","v":67.307000000000002},{"$f":"IF(E$20=\"\",\"\",IF(E$20>G68,\"Yes\",\"\"))","v":""}]
[{"$f":"'Methods&Limits'!A16","v":"-- Petrol with bioethanol content 2-4"},{"$f":"'Methods&Limits'!B16","v":"kPa"},{"$f":"'Methods&Limits'!E16","v":"EN 1601"},{"$f":"'Methods&Limits'!F16","v":2017},{"$f":"'Methods&Limits'!G16","v":2.2999999999999998},null,{"$f":"'Methods&Limits'!I16","v":69.156999999999996},""]
[{"$f":"'Methods&Limits'!A17","v":"-- Petrol with bioethanol content 4-6"},{"$f":"'Methods&Limits'!B17","v":"kPa"},{"$f":"'Methods&Limits'!E17","v":"EN 1601"},{"$f":"'Methods&Limits'!F17","v":2017},{"$f":"'Methods&Limits'!G17","v":2.2999999999999998},null,{"$f":"'Methods&Limits'!I17","v":69.356999999999999},""]
[{"$f":"'Methods&Limits'!A18","v":"-- Petrol with bioethanol content 6-8"},{"$f":"'Methods&Limits'!B18","v":"kPa"},{"$f":"'Methods&Limits'!E18","v":"EN 1601"},{"$f":"'Methods&Limits'!F18","v":2017},{"$f":"'Methods&Limits'!G18","v":2.2999999999999998},null,{"$f":"'Methods&Limits'!I18","v":69.236999999999995},""]
[{"$f":"'Methods&Limits'!A19","v":"-- Petrol with bioethanol content 8-10"},{"$f":"'Methods&Limits'!B19","v":"kPa"},{"$f":"'Methods&Limits'!E19","v":"EN 1601"},{"$f":"'Methods&Limits'!F19","v":2017},{"$f":"'Methods&Limits'!G19","v":2.2999999999999998},null,{"$f":"'Methods&Limits'!I19","v":69.117000000000004},""]
[{"$f":"'Methods&Limits'!A20","v":"--summer period (arctic or severe weather conditions)"},{"$f":"'Methods&Limits'!B20","v":"kPa"},{"$f":"'Methods&Limits'!E20","v":"EN 13016-1"},{"$f":"'Methods&Limits'!F20","v":2018},{"$f":"'Methods&Limits'!G20","v":2.2999999999999998},null,{"$f":"'Methods&Limits'!I20","v":71.356999999999999},""]
[{"$f":"'Methods&Limits'!A21","v":"Distillation *"}]
[{"$f":"'Methods&Limits'!A22","v":"--evaporated at 100 oC"},{"$f":"'Methods&Limits'!B22","v":"% V/V"},{"$f":"'Methods&Limits'!E22","v":"EN-ISO 3405"},{"$f":"'Methods&Limits'!F22","v":2020},{"$f":"'Methods&Limits'!G22","v":4},{"$f":"'Methods&Limits'!H22","v":43.64},null,{"$f":"IF(D22=\"\",\"\",IF(D22<F75,\"Yes\",\"\"))","v":"Yes"}]
[{"$f":"'Methods&Limits'!A23","v":"-- evaporated at 150 oC "},{"$f":"'Methods&Limits'!B23","v":"% V/V"},{"$f":"'Methods&Limits'!E23","v":"EN-ISO 3405"},{"$f":"'Methods&Limits'!F23","v":2020},{"$f":"'Methods&Limits'!G23","v":4},{"$f":"'Methods&Limits'!H23","v":72.64},null,{"$f":"IF(D23=\"\",\"\",IF(D23<F76,\"Yes\",\"\"))","v":"Yes"}]
[{"$f":"'Methods&Limits'!A24","v":"Hydrocarbon analysis"},null,null,null,null,null,null,{"$f":"IF(D24<F77,\"Yes\",\"\")","v":""}]
[{"$f":"'Methods&Limits'!A25","v":"-- Olefins"},{"$f":"'Methods&Limits'!B25","v":"% V/V"},{"$f":"'Methods&Limits'!E25","v":"EN 15553"},{"$f":"'Methods&Limits'!F25","v":2021},{"$f":"'Methods&Limits'!G25","v":6.4},null,{"$f":"'Methods&Limits'!I25","v":21.776},{"$f":"IF(E$25=\"\",\"\",IF(E$25>G78,\"Yes\",\"\"))","v":""}]
[null,null,{"$f":"'Methods&Limits'!E26","v":"EN-ISO 22854"},{"$f":"'Methods&Limits'!F26","v":2021},{"$f":"'Methods&Limits'!G26","v":2.6},null,{"$f":"'Methods&Limits'!I26","v":19.533999999999999},{"$f":"IF(E$25=\"\",\"\",IF(E$25>G79,\"Yes\",\"\"))","v":""}]
[{"$f":"'Methods&Limits'!A27","v":"*without oxygenates"},null,{"$f":"'Methods&Limits'!E27","v":"EN 15553"},{"$f":"'Methods&Limits'!F27","v":2021},{"$f":"'Methods&Limits'!G27","v":"-"},null,{"$f":"'Methods&Limits'!I27","v":"-"},{"$f":"IF(E$25=\"\",\"\",IF(E$25>G80,\"Yes\",\"\"))","v":""}]
[null,null,{"$f":"'Methods&Limits'!E28","v":"EN-ISO 22854"},{"$f":"'Methods&Limits'!F28","v":2021},{"$f":"'Methods&Limits'!G28","v":"-"},null,{"$f":"'Methods&Limits'!I28","v":"-"},{"$f":"IF(E$25=\"\",\"\",IF(E$25>G81,\"Yes\",\"\"))","v":""}]
[{"$f":"'Methods&Limits'!A29","v":"-- Olefins (RON 91 fuel only)***"},{"$f":"'Methods&Limits'!B29","v":"% V/V"},{"$f":"'Methods&Limits'!E29","v":"ASTM D1319"},{"$f":"'Methods&Limits'!F29","v":2020},{"$f":"'Methods&Limits'!G29","v":5.0999999999999996},null,{"$f":"'Methods&Limits'!I29","v":24.009},{"$f":"IF(E$25=\"\",\"\",IF(E$25>G82,\"Yes\",\"\"))","v":""}]
[{"$f":"'Methods&Limits'!A30","v":"-- Aromatics (from 2005)"},null,{"$f":"'Methods&Limits'!E30","v":"EN-ISO 22854"},{"$f":"'Methods&Limits'!F30","v":2021},{"$f":"'Methods&Limits'!G30","v":1.7},null,{"$f":"'Methods&Limits'!I30","v":36.003},{"$f":"IF(E$26=\"\",\"\",IF(E$26>G83,\"Yes\",\"\"))","v":""}]
[{"$f":"'Methods&Limits'!A31","v":"-- Benzene"},{"$f":"'Methods&Limits'!B31","v":"% V/V"},{"$f":"'Methods&Limits'!E31","v":"EN 12177"},{"$f":"'Methods&Limits'!F31","v":2022},{"$f":"'Methods&Limits'!G31","v":0.1},null,{"$f":"'Methods&Limits'!I31","v":1.0589999999999999},{"$f":"IF(E$27=\"\",\"\",IF(E$27>G84,\"Yes\",\"\"))","v":""}]
[null,null,{"$f":"'Methods&Limits'!E32","v":"EN 238"},{"$f":"'Methods&Limits'!F32","v":1996},{"$f":"'Methods&Limits'!G32","v":0.17},null,{"$f":"'Methods&Limits'!I32","v":1.1003000000000001},{"$f":"IF(E$27=\"\",\"\",IF(E$27>G85,\"Yes\",\"\"))","v":""}]
[null,null,{"$f":"'Methods&Limits'!E33","v":"EN-ISO 22854"},{"$f":"'Methods&Limits'!F33","v":2021},{"$f":"'Methods&Limits'!G33","v":0.05},null,{"$f":"'Methods&Limits'!I33","v":1.0295000000000001},{"$f":"IF(E$27=\"\",\"\",IF(E$27>G86,\"Yes\",\"\"))","v":""}]
[{"$f":"'Methods&Limits'!A34","v":"Oxygen content"},{"$f":"'Methods&Limits'!B34","v":"% (m/m)"},{"$f":"'Methods&Limits'!E34","v":"EN 1601"},{"$f":"'Methods&Limits'!F34","v":2017},{"$f":"'Methods&Limits'!G34","v":0.41},null,{"$f":"'Methods&Limits'!I34","v":3.9419},{"$f":"IF(E$27=\"\",\"\",IF(E$27>G87,\"Yes\",\"\"))","v":""}]
[null,null,{"$f":"'Methods&Limits'!E35","v":"EN 1601"},{"$f":"'Methods&Limits'!F35","v":2017},{"$f":"'Methods&Limits'!G35","v":0.41},null,{"$f":"'Methods&Limits'!I35","v":2.9419},{"$f":"IF(E$27=\"\",\"\",IF(E$27>G88,\"Yes\",\"\"))","v":""}]
[{"$f":"'Methods&Limits'!A36","v":"Oxygenates"}]
[{"$f":"'Methods&Limits'!A37","v":"-- Methanol"},{"$f":"'Methods&Limits'!B37","v":"% V/V"},{"$f":"'Methods&Limits'!E37","v":"EN 1601"},{"$f":"'Methods&Limits'!F37","v":2017},{"$f":"'Methods&Limits'!G37","v":0.3},null,{"$f":"'Methods&Limits'!I37","v":3.177},{"$f":"IF(E31=\"\",\"\",IF(E31>G90,\"Yes\",\"\"))","v":""}]
[{"$f":"'Methods&Limits'!A38","v":"-- Ethanol"},{"$f":"'Methods&Limits'!B38","v":"% V/V"},{"$f":"'Methods&Limits'!E38","v":"EN 1601"},{"$f":"'Methods&Limits'!F38","v":2017},{"$f":"'Methods&Limits'!G38","v":0.8},null,{"$f":"'Methods&Limits'!I38","v":10.472},""]
[{"$f":"'Methods&Limits'!A39","v":"-- Iso-propyl alcohol"},{"$f":"'Methods&Limits'!B39","v":"% V/V"},{"$f":"'Methods&Limits'!E39","v":"EN 1601"},{"$f":"'Methods&Limits'!F39","v":2017},{"$f":"'Methods&Limits'!G39","v":0.9},null,{"$f":"'Methods&Limits'!I39","v":12.531000000000001},""]
[{"$f":"'Methods&Limits'!A40","v":"-- Tert-butyl alcohol"},{"$f":"'Methods&Limits'!B40","v":"% V/V"},{"$f":"'Methods&Limits'!E40","v":"EN 1601"},{"$f":"'Methods&Limits'!F40","v":2017},{"$f":"'Methods&Limits'!G40","v":1},null,{"$f":"'Methods&Limits'!I40","v":15.59},""]
[{"$f":"'Methods&Limits'!A41","v":"-- Iso-butyl alcohol"},{"$f":"'Methods&Limits'!B41","v":"% V/V"},{"$f":"'Methods&Limits'!E41","v":"EN 1601"},{"$f":"'Methods&Limits'!F41","v":2017},{"$f":"'Methods&Limits'!G41","v":1},null,{"$f":"'Methods&Limits'!I41","v":15.59},""]
[{"$f":"'Methods&Limits'!A42","v":"-- Ethers with 5 or more carbon atoms per molecule"},{"$f":"'Methods&Limits'!B42","v":"% V/V"},{"$f":"'Methods&Limits'!E42","v":"EN 1601"},{"$f":"'Methods&Limits'!F42","v":2017},{"$f":"'Methods&Limits'!G42","v":1},null,{"$f":"'Methods&Limits'!I42","v":22.59},""]
[{"$f":"'Methods&Limits'!A43","v":"-- other oxygenates"},{"$f":"'Methods&Limits'!B43","v":"% V/V"},{"$f":"'Methods&Limits'!E43","v":"EN 1601"},{"$f":"'Methods&Limits'!F43","v":2017},{"$f":"'Methods&Limits'!G43","v":1},null,{"$f":"'Methods&Limits'!I43","v":15.59},""]
[{"$f":"'Methods&Limits'!A44","v":"Oxygen content"},{"$f":"'Methods&Limits'!B44","v":"% (m/m)"},{"$f":"'Methods&Limits'!E44","v":"EN 13132"},{"$f":"'Methods&Limits'!F44","v":2002},{"$f":"'Methods&Limits'!G44","v":0.3},null,{"$f":"'Methods&Limits'!I44","v":3.8770000000000002},{"$f":"IF(E28=\"\",\"\",IF(E28>G97,\"Yes\",\"\"))","v":""}]
[null,null,{"$f":"'Methods&Limits'!E45","v":"EN 13132"},{"$f":"'Methods&Limits'!F45","v":2002},{"$f":"'Methods&Limits'!G45","v":0.3},null,{"$f":"'Methods&Limits'!I45","v":2.8770000000000002},{"$f":"IF(E29=\"\",\"\",IF(E29>G98,\"Yes\",\"\"))","v":""}]
[{"$f":"'Methods&Limits'!A46","v":"Oxygenates"}]
[{"$f":"'Methods&Limits'!A47","v":"-- Methanol"},{"$f":"'Methods&Limits'!B47","v":"% V/V"},{"$f":"'Methods&Limits'!E47","v":"EN 13132"},{"$f":"'Methods&Limits'!F47","v":2002},{"$f":"'Methods&Limits'!G47","v":0.3},null,{"$f":"'Methods&Limits'!I47","v":3.177},{"$f":"IF(E31=\"\",\"\",IF(E31>G100,\"Yes\",\"\"))","v":""}]
[{"$f":"'Methods&Limits'!A48","v":"-- Ethanol"},{"$f":"'Methods&Limits'!B48","v":"% V/V"},{"$f":"'Methods&Limits'!E48","v":"EN 13132"},{"$f":"'Methods&Limits'!F48","v":2002},{"$f":"'Methods&Limits'!G48","v":0.8},null,{"$f":"'Methods&Limits'!I48","v":10.472},""]
[{"$f":"'Methods&Limits'!A49","v":"-- Iso-propyl alcohol"},{"$f":"'Methods&Limits'!B49","v":"% V/V"},{"$f":"'Methods&Limits'!E49","v":"EN 13132"},{"$f":"'Methods&Limits'!F49","v":2002},{"$f":"'Methods&Limits'!G49","v":0.8},null,{"$f":"'Methods&Limits'!I49","v":12.472},""]
[{"$f":"'Methods&Limits'!A50","v":"-- Tert-butyl alcohol"},{"$f":"'Methods&Limits'!B50","v":"% V/V"},{"$f":"'Methods&Limits'!E50","v":"EN 13132"},{"$f":"'Methods&Limits'!F50","v":2002},{"$f":"'Methods&Limits'!G50","v":1},null,{"$f":"'Methods&Limits'!I50","v":15.59},""]
[{"$f":"'Methods&Limits'!A51","v":"-- Iso-butyl alcohol"},{"$f":"'Methods&Limits'!B51","v":"% V/V"},{"$f":"'Methods&Limits'!E51","v":"EN 13132"},{"$f":"'Methods&Limits'!F51","v":2002},{"$f":"'Methods&Limits'!G51","v":1},null,{"$f":"'Methods&Limits'!I51","v":15.59},""]
[{"$f":"'Methods&Limits'!A52","v":"-- Ethers with 5 or more carbon atoms per molecule"},{"$f":"'Methods&Limits'!B52","v":"% V/V"},{"$f":"'Methods&Limits'!E52","v":"EN 13132"},{"$f":"'Methods&Limits'!F52","v":2002},{"$f":"'Methods&Limits'!G52","v":1},null,{"$f":"'Methods&Limits'!I52","v":22.59},""]
[{"$f":"'Methods&Limits'!A53","v":"-- other oxygenates"},{"$f":"'Methods&Limits'!B53","v":"% V/V"},{"$f":"'Methods&Limits'!E53","v":"EN 13132"},{"$f":"'Methods&Limits'!F53","v":2002},{"$f":"'Methods&Limits'!G53","v":1},null,{"$f":"'Methods&Limits'!I53","v":15.59},""]
[{"$f":"'Methods&Limits'!A54","v":"Oxygen content"},{"$f":"'Methods&Limits'!B54","v":"% (m/m)"},{"$f":"'Methods&Limits'!E54","v":"EN-ISO 22854"},{"$f":"'Methods&Limits'!F54","v":2021},{"$f":"'Methods&Limits'!G54","v":0.4},null,{"$f":"'Methods&Limits'!I54","v":3.9359999999999999},{"$f":"IF(E28=\"\",\"\",IF(E28>G107,\"Yes\",\"\"))","v":""}]
[null,null,{"$f":"'Methods&Limits'!E55","v":"EN-ISO 22854"},{"$f":"'Methods&Limits'!F55","v":2021},{"$f":"'Methods&Limits'!G55","v":0.4},null,{"$f":"'Methods&Limits'!I55","v":2.9359999999999999},{"$f":"IF(E29=\"\",\"\",IF(E29>G108,\"Yes\",\"\"))","v":""}]
[{"$f":"'Methods&Limits'!A56","v":"Oxyginates"}]
[{"$f":"'Methods&Limits'!A57","v":"-- Methanol"},{"$f":"'Methods&Limits'!B57","v":"% V/V"},{"$f":"'Methods&Limits'!E57","v":"EN-ISO 22854"},{"$f":"'Methods&Limits'!F57","v":2021},{"$f":"'Methods&Limits'!G57","v":0.4},null,{"$f":"'Methods&Limits'!I57","v":3.2359999999999998},{"$f":"IF(E31=\"\",\"\",IF(E31>G110,\"Yes\",\"\"))","v":""}]
[{"$f":"'Methods&Limits'!A58","v":"-- Ethanol"},{"$f":"'Methods&Limits'!B58","v":"% V/V"},{"$f":"'Methods&Limits'!E58","v":"EN-ISO 22854"},{"$f":"'Methods&Limits'!F58","v":2021},{"$f":"'Methods&Limits'!G58","v":0.6},null,{"$f":"'Methods&Limits'!I58","v":10.353999999999999},""]
[{"$f":"'Methods&Limits'!A59","v":"-- Iso-propyl alcohol"},{"$f":"'Methods&Limits'!B59","v":"% V/V"},{"$f":"'Methods&Limits'!E59","v":"EN-ISO 22854"},{"$f":"'Methods&Limits'!F59","v":2021},{"$f":"'Methods&Limits'!G59","v":0.7},null,{"$f":"'Methods&Limits'!I59","v":12.413},""]
[{"$f":"'Methods&Limits'!A60","v":"-- Tert-butyl alcohol"},{"$f":"'Methods&Limits'!B60","v":"% V/V"},{"$f":"'Methods&Limits'!E60","v":"EN-ISO 22854"},{"$f":"'Methods&Limits'!F60","v":2021},{"$f":"'Methods&Limits'!G60","v":0.7},null,{"$f":"'Methods&Limits'!I60","v":15.413},""]
[{"$f":"'Methods&Limits'!A61","v":"-- Iso-butyl alcohol"},{"$f":"'Methods&Limits'!B61","v":"% V/V"},{"$f":"'Methods&Limits'!E61","v":"EN-ISO 22854"},{"$f":"'Methods&Limits'!F61","v":2021},{"$f":"'Methods&Limits'!G61","v":0.7},null,{"$f":"'Methods&Limits'!I61","v":15.413},""]
[{"$f":"'Methods&Limits'!A62","v":"-- Ethers with 5 or more carbon atoms per molecule"},{"$f":"'Methods&Limits'!B62","v":"% V/V"},{"$f":"'Methods&Limits'!E62","v":"EN-ISO 22854"},{"$f":"'Methods&Limits'!F62","v":2021},{"$f":"'Methods&Limits'!G62","v":0.9},null,{"$f":"'Methods&Limits'!I62","v":22.530999999999999},""]
[{"$f":"'Methods&Limits'!A63","v":"-- other oxygenates"},{"$f":"'Methods&Limits'!B63","v":"% V/V"},{"$f":"'Methods&Limits'!E63","v":"EN-ISO 22854"},{"$f":"'Methods&Limits'!F63","v":2021},{"$f":"'Methods&Limits'!G63","v":0.7},null,{"$f":"'Methods&Limits'!I63","v":15.413},""]
[{"$f":"'Methods&Limits'!A64:A64","v":"Sulphur content (sulphur free, from 2005)**"},{"$f":"'Methods&Limits'!B64","v":"mg/kg"},{"$f":"'Methods&Limits'!E64","v":"EN-ISO 14596"},{"$f":"'Methods&Limits'!F64","v":2018},{"$f":"'Methods&Limits'!G64","v":5},null,{"$f":"'Methods&Limits'!I64","v":12.95},{"$f":"IF(E$38=\"\",\"\",IF(E$38>G117,\"Yes\",\"\"))","v":""}]
[null,null,{"$f":"'Methods&Limits'!E65","v":"EN 24260"},{"$f":"'Methods&Limits'!F65","v":1994},{"$f":"'Methods&Limits'!G65","v":1},null,{"$f":"'Methods&Limits'!I65","v":10.59},{"$f":"IF(E$38=\"\",\"\",IF(E$38>G118,\"Yes\",\"\"))","v":""}]
[null,null,{"$f":"'Methods&Limits'!E66","v":"EN-ISO 20846"},{"$f":"'Methods&Limits'!F66","v":2019},{"$f":"'Methods&Limits'!G66","v":2.7},null,{"$f":"'Methods&Limits'!I66","v":11.593},{"$f":"IF(E$38=\"\",\"\",IF(E$38>G119,\"Yes\",\"\"))","v":""}]
[null,null,{"$f":"'Methods&Limits'!E67","v":"EN-ISO 20884"},{"$f":"'Methods&Limits'!F67","v":2019},{"$f":"'Methods&Limits'!G67","v":3.1},null,{"$f":"'Methods&Limits'!I67","v":11.829000000000001},{"$f":"IF(E$38=\"\",\"\",IF(E$38>G120,\"Yes\",\"\"))","v":""}]
[{"$f":"'Methods&Limits'!A68:A68","v":"Lead content"},{"$f":"'Methods&Limits'!B68","v":"g/l"},{"$f":"'Methods&Limits'!E68","v":"EN 237"},{"$f":"'Methods&Limits'!F68","v":2004},{"$f":"'Methods&Limits'!G68","v":6.1999999999999998E-3},null,{"$f":"'Methods&Limits'!I68","v":8.657999999999999E-3},{"$f":"IF(E39=\"\",\"\",IF(E39>G121,\"Yes\",\"\"))","v":""}]

{"sheet":"Petrol (3)","index":16,"n_rows":121,"n_cols":18,"rows_kept":121,"cut":false,"hidden":false,"merged":[[2,1,2,4],[2,6,9,16],[3,1,3,4],[4,1,4,4],[5,1,5,4],[6,1,6,4],[7,2,7,4],[13,2,14,10],[13,11,13,14],[13,15,13,16],[14,11,14,12],[14,13,14,14],[14,15,14,16],[58,2,58,8],[58,9,58,12],[20,15,22,15],[27,15,28,15],[27,16,28,16],[43,0,43,3],[44,4,45,11],[46,4,46,11],[47,4,47,11],[48,4,48,11],[49,4,49,11],[50,4,50,11],[53,0,53,11],[71,11,71,12],[59,5,59,6],[59,9,60,9],[61,11,61,12],[62,11,62,12],[63,11,63,12],[64,11,64,12],[66,11,66,12],[67,11,67,12],[68,11,68,12],[69,11,69,12],[70,11,70,12],[59,11,59,12],[85,11,85,12],[72,11,72,12],[74,11,74,12],[75,11,75,12],[77,11,77,12],[78,11,78,12],[79,11,79,12],[80,11,80,12],[81,11,81,12],[82,11,82,12],[83,11,83,12],[84,11,84,12],[99,11,99,12],[86,11,86,12],[87,11,87,12],[89,11,89,12],[90,11,90,12],[91,11,91,12],[92,11,92,12],[93,11,93,12],[94,11,94,12],[95,11,95,12],[96,11,96,12],[97,11,97,12],[112,11,112,12],[100,11,100,12],[101,11,101,12],[102,11,102,12],[103,11,103,12],[104,11,104,12],[105,11,105,12],[106,11,106,12],[107,11,107,12],[109,11,109,12],[110,11,110,12],[111,11,111,12],[119,11,119,12],[120,11,120,12],[121,11,121,12],[122,11,122,12],[113,11,113,12],[114,11,114,12],[115,11,115,12],[116,11,116,12],[117,11,117,12],[118,11,118,12]]}
["Market Fuels used in Vehicles with Spark Ignition Engines (Petrol)",null,null,null,null,null,null,null,null,null,null,null,null,null,null,null,null,"<-- GO BACK"]
[]
["Country",{"$f":"IF(LEN('Contacts&Annual Summary'!C9) > 1,'Contacts&Annual Summary'!C9,\"\")","v":""},null,null,null,null,"Notes on completing the tables\nThe table structure has been locked to prevent modification - data can be copied and pasted, in bulk into the Reporting Results blue table cells.  Where a white row exists between rows, it will not be possible to paste over white rows and sections should be pasted separately.\n\nColumn H in the Test Methods and Analysis table is set to automatically check whether the values entered in the Reporting Results table exceed maximum or minimum Tolerance Limits.  If any exceedance is detected, please provide details in the columns to the right including the number of samples, location samples were taken from, Values and Details of any action taken to address non-compliant samples.  Compliance information is verified manually and this automated compliance check is not solely relied upon during data analysis.\n\nPlease do not unlock this template - modified templates cannot be processed and may delay reporting."]
["Reporting Year",{"$f":"'Contacts&Annual Summary'!C8","v":2023}]
["Period (Summer or Winter)","Summer"]
["Parent fuel grade","Petrol"]
["National fuel grade"]
["Summer Period (N or A)*",0,{"$f":"IF( B8=\"A\",\"1st June to 31st August (arctic)\",\"1st May to 30th September (normal)\")","v":"1st May to 30th September (normal)"}]
["The maximum bioethanol content (% v/v)",0,"Please include the bioethanol content as a numerical figure in % V/V"]
["* N = 1st May to 30th September (normal) ; A = 1st June to 31st August (arctic)."]
[]
["Reporting results"]
[]
["Parameter","Unit","Analytical and statistical results \n(Please see an explanation and examples for new columns/ information required in Cells I15 to K37 on the Introduction & Instructions tab).",null,null,null,null,null,null,null,null,"Limiting Value (1)",null,null,null,"Test method"]
[null,null,null,null,null,null,null,null,null,null,null,"National Specification, if any",null,"According to Directive 2009/30/EC",null,"(more recent versions may also be used)"]
[null,null,"No Samples","Minimum","Maximum","Median","Mean","Standard Deviation","No Samples outside 95% tolerance limit","25% of Sample Value","75% of Sample Value","Minimum","Maximum","Minimum","Maximum","Method","Date"]
["Research Octane Number","--",0,0,0,0,0,0,0,0,0,null,null,"95 (2)",null,"EN-ISO 5164",2005]
["Motor Octane Number","--",0,0,0,0,0,0,0,0,0,null,null,"85 (3)",null,"EN-ISO 5163",2005]
["Vapour Pressure, DVPE (6)","kPa",null,null,null,null,null,null,null,null,null,null,null,null,"(4)"]
["-- required for summer period only",null,0,0,0,0,0,0,0,0,0,null,null,null,{"$f":"IF(E8=\"A\",70,60)","v":60},"EN 13106-1",2007]
["Distillation",null,null,null,null,null,null,null,null,null,null,null,null,null,null,"EN-ISO 3405"]
["-- evaporated at 100 oC","% V/V",0,0,0,0,0,0,0,0,0,null,null,46,null,null,2000]
["-- evaporated at 150 oC ","% V/V",0,0,0,0,0,0,0,0,0,null,null,75]
["Hydrocarbon analysis"]
["-- Olefins","% V/V",0,0,0,0,0,0,0,0,0,null,null,null,"18.0 (5)","ASTM D 1319\nEN 15553\nEN-ISO 22854","1995\n2007\n2008"]
["-- Aromatics","% V/V",0,0,0,0,0,0,0,0,0,null,null,null,35,"EN-ISO 22854","1995\n2008"]
["-- Benzene","% V/V",0,0,0,0,0,0,0,0,0,null,null,null,1,"EN 238\nEN 12177\nEN-ISO 22854","1996\n1998\n2008"]
[{"$f":"IF(C29>0,\"Do not complete\",\"Oxygen content\")","v":"Oxygen content"},"% (m/m)",0,0,0,0,0,0,0,0,0,null,null,null,3.7,"EN 1601\nEN 13132\nEN-ISO 22854","1997\n2000\n2008"]
[{"$f":"IF(C28>0,\"Do not complete\",\"Oxygen content*\n*petrol with 5% (v/v) or less ethanol content\")","v":"Oxygen content*\n*petrol with 5% (v/v) or less ethanol content"},"% (m/m)",0,0,0,0,0,0,0,0,0,null,null,null,2.7]
["Oxygenates"]
["-- Methanol","% V/V",0,0,0,0,0,0,0,0,0,null,null,null,3]
["-- Ethanol","% V/V",0,0,0,0,0,0,0,0,0,null,null,null,10]
["-- Iso-propyl alcohol","% V/V",0,0,0,0,0,0,0,0,0,null,null,null,12,"EN 1601",1997]
["-- Tert-butyl alcohol","% V/V",0,0,0,0,0,0,0,0,0,null,null,null,15,"EN 13132",2000]
["-- Iso-butyl alcohol","% V/V",0,0,0,0,0,0,0,0,0,null,null,null,15,"EN-ISO 22854",2008]
["-- Ethers with ≥5 carbon atoms / molecule","% V/V",0,0,0,0,0,0,0,0,0,null,null,null,22]
["-- other oxygenates","% V/V",0,0,0,0,0,0,0,0,0,null,null,null,15]
["Sulphur content","mg/kg",0,0,0,0,0,0,0,0,0,null,null,null,10,"EN-ISO 14596\nEN 24260\nEN-ISO 20846\nEN-ISO 20884","1998\n1994\n2004\n2004"]
["Lead content","g/l",0,0,0,0,0,0,0,0,0,null,null,null,5.0000000000000001E-3,"EN 237",1996]
[]
[]
["Sampling frequency"]
[]
["Number of samples in month"]
["January",0,"July",0,"(1) The limiting values are \"true values\" and were established according to the procedures for limit setting in EN 228:2008  The results of individual measurements shall be interpreted following the criteria described in EN 228:2008."]
["February",0,"August",0]
["March",0,"September",0,"(2) 91 for unleaded regular grade petrol: See 2009/30/EC Annex I, Footnote 3."]
["April",0,"October",0,"(3) 81 for unleaded regular grade petrol: See 2009/30/EC Annex I, Footnote 3."]
["May",0,"November",0,"(4) 70 kPa for Member States with arctic or severe weather conditions: See 2003/30/EC Annex I, Footnotes 4 & 5."]
["June",0,"December",0,"(5) 21 for unleaded regular grade petrol: See 98/70/EC, Annex I, Footnote 6."]
[null,null,"Summer Months Total",{"$f":"SUM(B45:B50,D45:D50)","v":0},"(6) Vapour pressure waiver applies for petrol containing Bioethanol, see 2009/30/EC Annex I, Footnote 5 and Annex III."]
[]
["Other notes (optional):"]
[]
[]
[]
["Test Methods and Analysis"]
[]
["Parameter","Unit","Test specified in 2009/30/EC or EN228:2008",null,null,null,null,null,null,"Notes on exceedences"]
[null,null,"Method","Date","Reproducability, R","Tolerance limits",null,null,null,"Sample location (S,T or R)","Values","Details/action taken"]
[null,null,null,null,null,"Minimum","Maximum","Exceeded?"]
[{"$f":"'Methods&Limits'!A9","v":"Research Octane Number (RON)"},{"$f":"'Methods&Limits'!B9","v":"--"},{"$f":"'Methods&Limits'!E9","v":"EN-ISO 5164"},{"$f":"'Methods&Limits'!F9","v":2014},{"$f":"'Methods&Limits'!G9","v":0.7},{"$f":"'Methods&Limits'!H9","v":94.587000000000003},null,{"$f":"IF(D17=\"\",\"\",IF(D17<F62,\"Yes\",\"\"))","v":"Yes"}]
[{"$f":"'Methods&Limits'!A10","v":"(RON 91 fuel only)"},{"$f":"'Methods&Limits'!B10","v":"--"},{"$f":"'Methods&Limits'!E10","v":"EN-ISO 5164"},{"$f":"'Methods&Limits'!F10","v":2014},{"$f":"'Methods&Limits'!G10","v":0.7},{"$f":"'Methods&Limits'!H10","v":90.587000000000003},null,{"$f":"IF(D17=\"\",\"\",IF(D17<F63,\"Yes\",\"\"))","v":"Yes"}]
[{"$f":"'Methods&Limits'!A11","v":"Motor Octane Number (MON)"},{"$f":"'Methods&Limits'!B11","v":"--"},{"$f":"'Methods&Limits'!E11","v":"EN-ISO 5163"},{"$f":"'Methods&Limits'!F11","v":2014},{"$f":"'Methods&Limits'!G11","v":0.9},{"$f":"'Methods&Limits'!H11","v":84.468999999999994},null,{"$f":"IF(D18=\"\",\"\",IF(D18<F64,\"Yes\",\"\"))","v":"Yes"}]
[{"$f":"'Methods&Limits'!A12","v":"(RON 91 fuel only)"},{"$f":"'Methods&Limits'!B12","v":"--"},{"$f":"'Methods&Limits'!E12","v":"EN-ISO 5163"},{"$f":"'Methods&Limits'!F12","v":2014},{"$f":"'Methods&Limits'!G12","v":0.9},{"$f":"'Methods&Limits'!H12","v":80.468999999999994},null,{"$f":"IF(D18=\"\",\"\",IF(D18<F65,\"Yes\",\"\"))","v":"Yes"}]
[{"$f":"'Methods&Limits'!A13","v":"Vapour Pressure, DVPE"}]
[{"$f":"'Methods&Limits'!A14","v":"--summer period (normal)"},{"$f":"'Methods&Limits'!B14","v":"kPa"},{"$f":"'Methods&Limits'!E14","v":"EN 13016-1"},{"$f":"'Methods&Limits'!F14","v":2018},{"$f":"'Methods&Limits'!G14","v":2.2000000000000002},null,{"$f":"'Methods&Limits'!I14","v":61.298000000000002},{"$f":"IF(E20>G67,\"Yes\",\"\")","v":""}]
[{"$f":"'Methods&Limits'!A15","v":"-- Petrol with bioethanol content 0-2"},{"$f":"'Methods&Limits'!B15","v":"kPa"},{"$f":"'Methods&Limits'!E15","v":"EN 1601"},{"$f":"'Methods&Limits'!F15","v":2017},{"$f":"'Methods&Limits'!G15","v":2.2999999999999998},null,{"$f":"'Methods&Limits'!I15","v":67.307000000000002},{"$f":"IF(E20>G68,\"Yes\",\"\")","v":""}]
[{"$f":"'Methods&Limits'!A16","v":"-- Petrol with bioethanol content 2-4"},{"$f":"'Methods&Limits'!B16","v":"kPa"},{"$f":"'Methods&Limits'!E16","v":"EN 1601"},{"$f":"'Methods&Limits'!F16","v":2017},{"$f":"'Methods&Limits'!G16","v":2.2999999999999998},null,{"$f":"'Methods&Limits'!I16","v":69.156999999999996},{"$f":"IF(E20>G69,\"Yes\",\"\")","v":""}]
[{"$f":"'Methods&Limits'!A17","v":"-- Petrol with bioethanol content 4-6"},{"$f":"'Methods&Limits'!B17","v":"kPa"},{"$f":"'Methods&Limits'!E17","v":"EN 1601"},{"$f":"'Methods&Limits'!F17","v":2017},{"$f":"'Methods&Limits'!G17","v":2.2999999999999998},null,{"$f":"'Methods&Limits'!I17","v":69.356999999999999},{"$f":"IF(E20>G70,\"Yes\",\"\")","v":""}]
[{"$f":"'Methods&Limits'!A18","v":"-- Petrol with bioethanol content 6-8"},{"$f":"'Methods&Limits'!B18","v":"kPa"},{"$f":"'Methods&Limits'!E18","v":"EN 1601"},{"$f":"'Methods&Limits'!F18","v":2017},{"$f":"'Methods&Limits'!G18","v":2.2999999999999998},null,{"$f":"'Methods&Limits'!I18","v":69.236999999999995},{"$f":"IF(E20>G71,\"Yes\",\"\")","v":""}]
[{"$f":"'Methods&Limits'!A19","v":"-- Petrol with bioethanol content 8-10"},{"$f":"'Methods&Limits'!B19","v":"kPa"},{"$f":"'Methods&Limits'!E19","v":"EN 1601"},{"$f":"'Methods&Limits'!F19","v":2017},{"$f":"'Methods&Limits'!G19","v":2.2999999999999998},null,{"$f":"'Methods&Limits'!I19","v":69.117000000000004},{"$f":"IF(E20>G72,\"Yes\",\"\")","v":""}]
[{"$f":"'Methods&Limits'!A20","v":"--summer period (arctic or severe weather conditions)"},{"$f":"'Methods&Limits'!B20","v":"kPa"},{"$f":"'Methods&Limits'!E20","v":"EN 13016-1"},{"$f":"'Methods&Limits'!F20","v":2018},{"$f":"'Methods&Limits'!G20","v":2.2999999999999998},null,{"$f":"'Methods&Limits'!I20","v":71.356999999999999},{"$f":"IF(E20>G73,\"Yes\",\"\")","v":""}]
[{"$f":"'Methods&Limits'!A21","v":"Distillation *"}]
[{"$f":"'Methods&Limits'!A22","v":"--evaporated at 100 oC"},{"$f":"'Methods&Limits'!B22","v":"% V/V"},{"$f":"'Methods&Limits'!E22","v":"EN-ISO 3405"},{"$f":"'Methods&Limits'!F22","v":2020},{"$f":"'Methods&Limits'!G22","v":4},{"$f":"'Methods&Limits'!H22","v":43.64},null,{"$f":"IF(D22=\"\",\"\",IF(D22<F75,\"Yes\",\"\"))","v":"Yes"}]
[{"$f":"'Methods&Limits'!A23","v":"-- evaporated at 150 oC "},{"$f":"'Methods&Limits'!B23","v":"% V/V"},{"$f":"'Methods&Limits'!E23","v":"EN-ISO 3405"},{"$f":"'Methods&Limits'!F23","v":2020},{"$f":"'Methods&Limits'!G23","v":4},{"$f":"'Methods&Limits'!H23","v":72.64},null,{"$f":"IF(D23=\"\",\"\",IF(D23<F76,\"Yes\",\"\"))","v":"Yes"}]
[{"$f":"'Methods&Limits'!A24","v":"Hydrocarbon analysis"},null,null,null,null,null,null,{"$f":"IF(D24<F77,\"Yes\",\"\")","v":""}]
[{"$f":"'Methods&Limits'!A25","v":"-- Olefins"},{"$f":"'Methods&Limits'!B25","v":"% V/V"},{"$f":"'Methods&Limits'!E25","v":"EN 15553"},{"$f":"'Methods&Limits'!F25","v":2021},{"$f":"'Methods&Limits'!G25","v":6.4},null,{"$f":"'Methods&Limits'!I25","v":21.776},{"$f":"IF($E$25>G78,\"Yes\",\"\")","v":""}]
[null,null,{"$f":"'Methods&Limits'!E26","v":"EN-ISO 22854"},{"$f":"'Methods&Limits'!F26","v":2021},{"$f":"'Methods&Limits'!G26","v":2.6},null,{"$f":"'Methods&Limits'!I26","v":19.533999999999999},{"$f":"IF($E$25>G79,\"Yes\",\"\")","v":""}]
[{"$f":"'Methods&Limits'!A27","v":"*without oxygenates"},null,{"$f":"'Methods&Limits'!E27","v":"EN 15553"},{"$f":"'Methods&Limits'!F27","v":2021},{"$f":"'Methods&Limits'!G27","v":"-"},null,{"$f":"'Methods&Limits'!I27","v":"-"},{"$f":"IF($E$25>G80,\"Yes\",\"\")","v":""}]
[null,null,{"$f":"'Methods&Limits'!E28","v":"EN-ISO 22854"},{"$f":"'Methods&Limits'!F28","v":2021},{"$f":"'Methods&Limits'!G28","v":"-"},null,{"$f":"'Methods&Limits'!I28","v":"-"},{"$f":"IF($E$25>G81,\"Yes\",\"\")","v":""}]
[{"$f":"'Methods&Limits'!A29","v":"-- Olefins (RON 91 fuel only)***"},{"$f":"'Methods&Limits'!B29","v":"% V/V"},{"$f":"'Methods&Limits'!E29","v":"ASTM D1319"},{"$f":"'Methods&Limits'!F29","v":2020},{"$f":"'Methods&Limits'!G29","v":5.0999999999999996},null,{"$f":"'Methods&Limits'!I29","v":24.009},{"$f":"IF($E$25>G82,\"Yes\",\"\")","v":""}]
[{"$f":"'Methods&Limits'!A30","v":"-- Aromatics (from 2005)"},null,{"$f":"'Methods&Limits'!E30","v":"EN-ISO 22854"},{"$f":"'Methods&Limits'!F30","v":2021},{"$f":"'Methods&Limits'!G30","v":1.7},null,{"$f":"'Methods&Limits'!I30","v":36.003},{"$f":"IF($E$26>G83,\"Yes\",\"\")","v":""}]
[{"$f":"'Methods&Limits'!A31","v":"-- Benzene"},{"$f":"'Methods&Limits'!B31","v":"% V/V"},{"$f":"'Methods&Limits'!E31","v":"EN 12177"},{"$f":"'Methods&Limits'!F31","v":2022},{"$f":"'Methods&Limits'!G31","v":0.1},null,{"$f":"'Methods&Limits'!I31","v":1.0589999999999999},{"$f":"IF(E27>G84,\"Yes\",\"\")","v":""}]
[null,null,{"$f":"'Methods&Limits'!E32","v":"EN 238"},{"$f":"'Methods&Limits'!F32","v":1996},{"$f":"'Methods&Limits'!G32","v":0.17},null,{"$f":"'Methods&Limits'!I32","v":1.1003000000000001},{"$f":"IF(E27>G85,\"Yes\",\"\")","v":""}]
[null,null,{"$f":"'Methods&Limits'!E33","v":"EN-ISO 22854"},{"$f":"'Methods&Limits'!F33","v":2021},{"$f":"'Methods&Limits'!G33","v":0.05},null,{"$f":"'Methods&Limits'!I33","v":1.0295000000000001},{"$f":"IF(E27>G86,\"Yes\",\"\")","v":""}]
[{"$f":"'Methods&Limits'!A34","v":"Oxygen content"},{"$f":"'Methods&Limits'!B34","v":"% (m/m)"},{"$f":"'Methods&Limits'!E34","v":"EN 1601"},{"$f":"'Methods&Limits'!F34","v":2017},{"$f":"'Methods&Limits'!G34","v":0.41},null,{"$f":"'Methods&Limits'!I34","v":3.9419},{"$f":"IF(E28>G87,\"Yes\",\"\")","v":""}]
[null,null,{"$f":"'Methods&Limits'!E35","v":"EN 1601"},{"$f":"'Methods&Limits'!F35","v":2017},{"$f":"'Methods&Limits'!G35","v":0.41},null,{"$f":"'Methods&Limits'!I35","v":2.9419},{"$f":"IF(E29>G88,\"Yes\",\"\")","v":""}]
[{"$f":"'Methods&Limits'!A36","v":"Oxygenates"}]
[{"$f":"'Methods&Limits'!A37","v":"-- Methanol"},{"$f":"'Methods&Limits'!B37","v":"% V/V"},{"$f":"'Methods&Limits'!E37","v":"EN 1601"},{"$f":"'Methods&Limits'!F37","v":2017},{"$f":"'Methods&Limits'!G37","v":0.3},null,{"$f":"'Methods&Limits'!I37","v":3.177},{"$f":"IF(E31>G90,\"Yes\",\"\")","v":""}]
[{"$f":"'Methods&Limits'!A38","v":"-- Ethanol"},{"$f":"'Methods&Limits'!B38","v":"% V/V"},{"$f":"'Methods&Limits'!E38","v":"EN 1601"},{"$f":"'Methods&Limits'!F38","v":2017},{"$f":"'Methods&Limits'!G38","v":0.8},null,{"$f":"'Methods&Limits'!I38","v":10.472},""]
[{"$f":"'Methods&Limits'!A39","v":"-- Iso-propyl alcohol"},{"$f":"'Methods&Limits'!B39","v":"% V/V"},{"$f":"'Methods&Limits'!E39","v":"EN 1601"},{"$f":"'Methods&Limits'!F39","v":2017},{"$f":"'Methods&Limits'!G39","v":0.9},null,{"$f":"'Methods&Limits'!I39","v":12.531000000000001},""]
[{"$f":"'Methods&Limits'!A40","v":"-- Tert-butyl alcohol"},{"$f":"'Methods&Limits'!B40","v":"% V/V"},{"$f":"'Methods&Limits'!E40","v":"EN 1601"},{"$f":"'Methods&Limits'!F40","v":2017},{"$f":"'Methods&Limits'!G40","v":1},null,{"$f":"'Methods&Limits'!I40","v":15.59},""]
[{"$f":"'Methods&Limits'!A41","v":"-- Iso-butyl alcohol"},{"$f":"'Methods&Limits'!B41","v":"% V/V"},{"$f":"'Methods&Limits'!E41","v":"EN 1601"},{"$f":"'Methods&Limits'!F41","v":2017},{"$f":"'Methods&Limits'!G41","v":1},null,{"$f":"'Methods&Limits'!I41","v":15.59},""]
[{"$f":"'Methods&Limits'!A42","v":"-- Ethers with 5 or more carbon atoms per molecule"},{"$f":"'Methods&Limits'!B42","v":"% V/V"},{"$f":"'Methods&Limits'!E42","v":"EN 1601"},{"$f":"'Methods&Limits'!F42","v":2017},{"$f":"'Methods&Limits'!G42","v":1},null,{"$f":"'Methods&Limits'!I42","v":22.59},""]
[{"$f":"'Methods&Limits'!A43","v":"-- other oxygenates"},{"$f":"'Methods&Limits'!B43","v":"% V/V"},{"$f":"'Methods&Limits'!E43","v":"EN 1601"},{"$f":"'Methods&Limits'!F43","v":2017},{"$f":"'Methods&Limits'!G43","v":1},null,{"$f":"'Methods&Limits'!I43","v":15.59},""]
[{"$f":"'Methods&Limits'!A44","v":"Oxygen content"},{"$f":"'Methods&Limits'!B44","v":"% (m/m)"},{"$f":"'Methods&Limits'!E44","v":"EN 13132"},{"$f":"'Methods&Limits'!F44","v":2002},{"$f":"'Methods&Limits'!G44","v":0.3},null,{"$f":"'Methods&Limits'!I44","v":3.8770000000000002},{"$f":"IF(E28>G97,\"Yes\",\"\")","v":""}]
[null,null,{"$f":"'Methods&Limits'!E45","v":"EN 13132"},{"$f":"'Methods&Limits'!F45","v":2002},{"$f":"'Methods&Limits'!G45","v":0.3},null,{"$f":"'Methods&Limits'!I45","v":2.8770000000000002},{"$f":"IF(E29>G98,\"Yes\",\"\")","v":""}]
[{"$f":"'Methods&Limits'!A46","v":"Oxygenates"}]
[{"$f":"'Methods&Limits'!A47","v":"-- Methanol"},{"$f":"'Methods&Limits'!B47","v":"% V/V"},{"$f":"'Methods&Limits'!E47","v":"EN 13132"},{"$f":"'Methods&Limits'!F47","v":2002},{"$f":"'Methods&Limits'!G47","v":0.3},null,{"$f":"'Methods&Limits'!I47","v":3.177},{"$f":"IF(E31>G100,\"Yes\",\"\")","v":""}]
[{"$f":"'Methods&Limits'!A48","v":"-- Ethanol"},{"$f":"'Methods&Limits'!B48","v":"% V/V"},{"$f":"'Methods&Limits'!E48","v":"EN 13132"},{"$f":"'Methods&Limits'!F48","v":2002},{"$f":"'Methods&Limits'!G48","v":0.8},null,{"$f":"'Methods&Limits'!I48","v":10.472},""]
[{"$f":"'Methods&Limits'!A49","v":"-- Iso-propyl alcohol"},{"$f":"'Methods&Limits'!B49","v":"% V/V"},{"$f":"'Methods&Limits'!E49","v":"EN 13132"},{"$f":"'Methods&Limits'!F49","v":2002},{"$f":"'Methods&Limits'!G49","v":0.8},null,{"$f":"'Methods&Limits'!I49","v":12.472},""]
[{"$f":"'Methods&Limits'!A50","v":"-- Tert-butyl alcohol"},{"$f":"'Methods&Limits'!B50","v":"% V/V"},{"$f":"'Methods&Limits'!E50","v":"EN 13132"},{"$f":"'Methods&Limits'!F50","v":2002},{"$f":"'Methods&Limits'!G50","v":1},null,{"$f":"'Methods&Limits'!I50","v":15.59},""]
[{"$f":"'Methods&Limits'!A51","v":"-- Iso-butyl alcohol"},{"$f":"'Methods&Limits'!B51","v":"% V/V"},{"$f":"'Methods&Limits'!E51","v":"EN 13132"},{"$f":"'Methods&Limits'!F51","v":2002},{"$f":"'Methods&Limits'!G51","v":1},null,{"$f":"'Methods&Limits'!I51","v":15.59},""]
[{"$f":"'Methods&Limits'!A52","v":"-- Ethers with 5 or more carbon atoms per molecule"},{"$f":"'Methods&Limits'!B52","v":"% V/V"},{"$f":"'Methods&Limits'!E52","v":"EN 13132"},{"$f":"'Methods&Limits'!F52","v":2002},{"$f":"'Methods&Limits'!G52","v":1},null,{"$f":"'Methods&Limits'!I52","v":22.59},""]
[{"$f":"'Methods&Limits'!A53","v":"-- other oxygenates"},{"$f":"'Methods&Limits'!B53","v":"% V/V"},{"$f":"'Methods&Limits'!E53","v":"EN 13132"},{"$f":"'Methods&Limits'!F53","v":2002},{"$f":"'Methods&Limits'!G53","v":1},null,{"$f":"'Methods&Limits'!I53","v":15.59},""]
[{"$f":"'Methods&Limits'!A54","v":"Oxygen content"},{"$f":"'Methods&Limits'!B54","v":"% (m/m)"},{"$f":"'Methods&Limits'!E54","v":"EN-ISO 22854"},{"$f":"'Methods&Limits'!F54","v":2021},{"$f":"'Methods&Limits'!G54","v":0.4},null,{"$f":"'Methods&Limits'!I54","v":3.9359999999999999},{"$f":"IF(E28>G107,\"Yes\",\"\")","v":""}]
[null,null,{"$f":"'Methods&Limits'!E55","v":"EN-ISO 22854"},{"$f":"'Methods&Limits'!F55","v":2021},{"$f":"'Methods&Limits'!G55","v":0.4},null,{"$f":"'Methods&Limits'!I55","v":2.9359999999999999},{"$f":"IF(E29>G108,\"Yes\",\"\")","v":""}]
[{"$f":"'Methods&Limits'!A56","v":"Oxyginates"}]
[{"$f":"'Methods&Limits'!A57","v":"-- Methanol"},{"$f":"'Methods&Limits'!B57","v":"% V/V"},{"$f":"'Methods&Limits'!E57","v":"EN-ISO 22854"},{"$f":"'Methods&Limits'!F57","v":2021},{"$f":"'Methods&Limits'!G57","v":0.4},null,{"$f":"'Methods&Limits'!I57","v":3.2359999999999998},{"$f":"IF(E31>G110,\"Yes\",\"\")","v":""}]
[{"$f":"'Methods&Limits'!A58","v":"-- Ethanol"},{"$f":"'Methods&Limits'!B58","v":"% V/V"},{"$f":"'Methods&Limits'!E58","v":"EN-ISO 22854"},{"$f":"'Methods&Limits'!F58","v":2021},{"$f":"'Methods&Limits'!G58","v":0.6},null,{"$f":"'Methods&Limits'!I58","v":10.353999999999999},""]
[{"$f":"'Methods&Limits'!A59","v":"-- Iso-propyl alcohol"},{"$f":"'Methods&Limits'!B59","v":"% V/V"},{"$f":"'Methods&Limits'!E59","v":"EN-ISO 22854"},{"$f":"'Methods&Limits'!F59","v":2021},{"$f":"'Methods&Limits'!G59","v":0.7},null,{"$f":"'Methods&Limits'!I59","v":12.413},""]
[{"$f":"'Methods&Limits'!A60","v":"-- Tert-butyl alcohol"},{"$f":"'Methods&Limits'!B60","v":"% V/V"},{"$f":"'Methods&Limits'!E60","v":"EN-ISO 22854"},{"$f":"'Methods&Limits'!F60","v":2021},{"$f":"'Methods&Limits'!G60","v":0.7},null,{"$f":"'Methods&Limits'!I60","v":15.413},""]
[{"$f":"'Methods&Limits'!A61","v":"-- Iso-butyl alcohol"},{"$f":"'Methods&Limits'!B61","v":"% V/V"},{"$f":"'Methods&Limits'!E61","v":"EN-ISO 22854"},{"$f":"'Methods&Limits'!F61","v":2021},{"$f":"'Methods&Limits'!G61","v":0.7},null,{"$f":"'Methods&Limits'!I61","v":15.413},""]
[{"$f":"'Methods&Limits'!A62","v":"-- Ethers with 5 or more carbon atoms per molecule"},{"$f":"'Methods&Limits'!B62","v":"% V/V"},{"$f":"'Methods&Limits'!E62","v":"EN-ISO 22854"},{"$f":"'Methods&Limits'!F62","v":2021},{"$f":"'Methods&Limits'!G62","v":0.9},null,{"$f":"'Methods&Limits'!I62","v":22.530999999999999},""]
[{"$f":"'Methods&Limits'!A63","v":"-- other oxygenates"},{"$f":"'Methods&Limits'!B63","v":"% V/V"},{"$f":"'Methods&Limits'!E63","v":"EN-ISO 22854"},{"$f":"'Methods&Limits'!F63","v":2021},{"$f":"'Methods&Limits'!G63","v":0.7},null,{"$f":"'Methods&Limits'!I63","v":15.413},""]
[{"$f":"'Methods&Limits'!A64:A64","v":"Sulphur content (sulphur free, from 2005)**"},{"$f":"'Methods&Limits'!B64","v":"mg/kg"},{"$f":"'Methods&Limits'!E64","v":"EN-ISO 14596"},{"$f":"'Methods&Limits'!F64","v":2018},{"$f":"'Methods&Limits'!G64","v":5},null,{"$f":"'Methods&Limits'!I64","v":12.95},{"$f":"IF(E$38>G117,\"Yes\",\"\")","v":""}]
[null,null,{"$f":"'Methods&Limits'!E65","v":"EN 24260"},{"$f":"'Methods&Limits'!F65","v":1994},{"$f":"'Methods&Limits'!G65","v":1},null,{"$f":"'Methods&Limits'!I65","v":10.59},{"$f":"IF(E$38>G118,\"Yes\",\"\")","v":""}]
[null,null,{"$f":"'Methods&Limits'!E66","v":"EN-ISO 20846"},{"$f":"'Methods&Limits'!F66","v":2019},{"$f":"'Methods&Limits'!G66","v":2.7},null,{"$f":"'Methods&Limits'!I66","v":11.593},{"$f":"IF(E$38>G119,\"Yes\",\"\")","v":""}]
[null,null,{"$f":"'Methods&Limits'!E67","v":"EN-ISO 20884"},{"$f":"'Methods&Limits'!F67","v":2019},{"$f":"'Methods&Limits'!G67","v":3.1},null,{"$f":"'Methods&Limits'!I67","v":11.829000000000001},{"$f":"IF(E$38>G120,\"Yes\",\"\")","v":""}]
[{"$f":"'Methods&Limits'!A68:A68","v":"Lead content"},{"$f":"'Methods&Limits'!B68","v":"g/l"},{"$f":"'Methods&Limits'!E68","v":"EN 237"},{"$f":"'Methods&Limits'!F68","v":2004},{"$f":"'Methods&Limits'!G68","v":6.1999999999999998E-3},null,{"$f":"'Methods&Limits'!I68","v":8.657999999999999E-3},{"$f":"IF($E$39>G121,\"Yes\",\"\")","v":""}]

{"sheet":"Petrol (4)","index":17,"n_rows":121,"n_cols":18,"rows_kept":121,"cut":false,"hidden":false,"merged":[[2,1,2,4],[2,6,9,16],[3,1,3,4],[4,1,4,4],[5,1,5,4],[6,1,6,4],[7,2,7,4],[13,2,14,10],[13,11,13,14],[13,15,13,16],[14,11,14,12],[14,13,14,14],[14,15,14,16],[58,2,58,8],[58,9,58,12],[20,15,22,15],[27,15,28,15],[27,16,28,16],[43,0,43,3],[44,4,45,11],[46,4,46,11],[47,4,47,11],[48,4,48,11],[49,4,49,11],[50,4,50,11],[53,0,53,11],[71,11,71,12],[59,5,59,6],[59,9,60,9],[61,11,61,12],[62,11,62,12],[63,11,63,12],[64,11,64,12],[66,11,66,12],[67,11,67,12],[68,11,68,12],[69,11,69,12],[70,11,70,12],[59,11,59,12],[85,11,85,12],[72,11,72,12],[74,11,74,12],[75,11,75,12],[77,11,77,12],[78,11,78,12],[79,11,79,12],[80,11,80,12],[81,11,81,12],[82,11,82,12],[83,11,83,12],[84,11,84,12],[99,11,99,12],[86,11,86,12],[87,11,87,12],[89,11,89,12],[90,11,90,12],[91,11,91,12],[92,11,92,12],[93,11,93,12],[94,11,94,12],[95,11,95,12],[96,11,96,12],[97,11,97,12],[112,11,112,12],[100,11,100,12],[101,11,101,12],[102,11,102,12],[103,11,103,12],[104,11,104,12],[105,11,105,12],[106,11,106,12],[107,11,107,12],[109,11,109,12],[110,11,110,12],[111,11,111,12],[119,11,119,12],[120,11,120,12],[121,11,121,12],[122,11,122,12],[113,11,113,12],[114,11,114,12],[115,11,115,12],[116,11,116,12],[117,11,117,12],[118,11,118,12]]}
["Market Fuels used in Vehicles with Spark Ignition Engines (Petrol)",null,null,null,null,null,null,null,null,null,null,null,null,null,null,null,null,"<-- GO BACK"]
[]
["Country",{"$f":"IF(LEN('Contacts&Annual Summary'!C9) > 1,'Contacts&Annual Summary'!C9,\"\")","v":""},null,null,null,null,"Notes on completing the tables\nThe table structure has been locked to prevent modification - data can be copied and pasted, in bulk into the Reporting Results blue table cells.  Where a white row exists between rows, it will not be possible to paste over white rows and sections should be pasted separately.\n\nColumn H in the Test Methods and Analysis table is set to automatically check whether the values entered in the Reporting Results table exceed maximum or minimum Tolerance Limits.  If any exceedance is detected, please provide details in the columns to the right including the number of samples, location samples were taken from, Values and Details of any action taken to address non-compliant samples.  Compliance information is verified manually and this automated compliance check is not solely relied upon during data analysis.\n\nPlease do not unlock this template - modified templates cannot be processed and may delay reporting."]
["Reporting Year",{"$f":"'Contacts&Annual Summary'!C8","v":2023}]
["Period (Summer or Winter)","Winter"]
["Parent fuel grade","Petrol"]
["National fuel grade",{"$f":"'Petrol (3)'!B7","v":0}]
["Summer Period (N or A)*",0,{"$f":"IF( B8=\"A\",\"1st June to 31st August (arctic)\",\"1st May to 30th September (normal)\")","v":"1st May to 30th September (normal)"}]
["The maximum bioethanol content (% v/v)",0,"Please include the bioethanol content as a numerical figure in % V/V"]
["* N = 1st May to 30th September (normal) ; A = 1st June to 31st August (arctic)."]
[]
["Reporting results"]
[]
["Parameter","Unit","Analytical and statistical results \n(Please see an explanation and examples for new columns/ information required in Cells I15 to K37 on the Introduction & Instructions tab).",null,null,null,null,null,null,null,null,"Limiting Value (1)",null,null,null,"Test method"]
[null,null,null,null,null,null,null,null,null,null,null,"National Specification, if any",null,"According to Directive 2009/30/EC",null,"(more recent versions may also be used)"]
[null,null,"No Samples","Minimum","Maximum","Median","Mean","Standard Deviation","No Samples outside 95% tolerance limit","25% of Sample Value","75% of Sample Value","Minimum","Maximum","Minimum","Maximum","Method","Date"]
["Research Octane Number","--",0,0,0,0,0,0,0,0,0,null,null,"95 (2)",null,"EN-ISO 5164",2005]
["Motor Octane Number","--",0,0,0,0,0,0,0,0,0,null,null,"85 (3)",null,"EN-ISO 5163",2005]
["Vapour Pressure, DVPE (6)","kPa",null,null,null,null,null,null,null,null,null,null,null,null,"(4)"]
["-- required for summer period only",null,0,0,0,0,0,0,0,0,0,null,null,null,{"$f":"IF(E8=\"A\",70,60)","v":60},"EN 13106-1",2007]
["Distillation",null,null,null,null,null,null,null,null,null,null,null,null,null,null,"EN-ISO 3405"]
["-- evaporated at 100 oC","% V/V",0,0,0,0,0,0,0,0,0,null,null,46,null,null,2000]
["-- evaporated at 150 oC ","% V/V",0,0,0,0,0,0,0,0,0,null,null,75]
["Hydrocarbon analysis"]
["-- Olefins","% V/V",0,0,0,0,0,0,0,0,0,null,null,null,"18.0 (5)","ASTM D 1319\nEN 15553\nEN-ISO 22854","1995\n2007\n2008"]
["-- Aromatics","% V/V",0,0,0,0,0,0,0,0,0,null,null,null,35,"EN-ISO 22854","1995\n2008"]
["-- Benzene","% V/V",0,0,0,0,0,0,0,0,0,null,null,null,1,"EN 238\nEN 12177\nEN-ISO 22854","1996\n1998\n2008"]
[{"$f":"IF(C29>0,\"Do not complete\",\"Oxygen content\")","v":"Oxygen content"},"% (m/m)",0,0,0,0,0,0,0,0,0,null,null,null,3.7,"EN 1601\nEN 13132\nEN-ISO 22854","1997\n2000\n2008"]
[{"$f":"IF(C28>0,\"Do not complete\",\"Oxygen content*\n*petrol with 5% (v/v) or less ethanol content\")","v":"Oxygen content*\n*petrol with 5% (v/v) or less ethanol content"},"% (m/m)",0,0,0,0,0,0,0,0,0,null,null,null,2.7]
["Oxygenates"]
["-- Methanol","% V/V",0,0,0,0,0,0,0,0,0,null,null,null,3]
["-- Ethanol","% V/V",0,0,0,0,0,0,0,0,0,null,null,null,10]
["-- Iso-propyl alcohol","% V/V",0,0,0,0,0,0,0,0,0,null,null,null,12,"EN 1601",1997]
["-- Tert-butyl alcohol","% V/V",0,0,0,0,0,0,0,0,0,null,null,null,15,"EN 13132",2000]
["-- Iso-butyl alcohol","% V/V",0,0,0,0,0,0,0,0,0,null,null,null,15,"EN-ISO 22854",2008]
["-- Ethers with ≥5 carbon atoms / molecule","% V/V",0,0,0,0,0,0,0,0,0,null,null,null,22]
["-- other oxygenates","% V/V",0,0,0,0,0,0,0,0,0,null,null,null,15]
["Sulphur content","mg/kg",0,0,0,0,0,0,0,0,0,null,null,null,10,"EN-ISO 14596\nEN 24260\nEN-ISO 20846\nEN-ISO 20884","1998\n1994\n2004\n2004"]
["Lead content","g/l",0,0,0,0,0,0,0,0,0,null,null,null,5.0000000000000001E-3,"EN 237",1996]
[]
[]
["Sampling frequency"]
[]
["Number of samples in month"]
["January",0,"July",0,"(1) The limiting values are \"true values\" and were established according to the procedures for limit setting in EN 228:2008  The results of individual measurements shall be interpreted following the criteria described in EN 228:2008."]
["February",0,"August",0]
["March",0,"September",0,"(2) 91 for unleaded regular grade petrol: See 2009/30/EC Annex I, Footnote 3."]
["April",0,"October",0,"(3) 81 for unleaded regular grade petrol: See 2009/30/EC Annex I, Footnote 3."]
["May",0,"November",0,"(4) 70 kPa for Member States with arctic or severe weather conditions: See 2003/30/EC Annex I, Footnotes 4 & 5."]
["June",0,"December",0,"(5) 21 for unleaded regular grade petrol: See 98/70/EC, Annex I, Footnote 6."]
[null,null,"Winter Months Total",{"$f":"SUM(B45:B50,D45:D50)","v":0},"(6) Vapour pressure waiver applies for petrol containing Bioethanol, see 2009/30/EC Annex I, Footnote 5 and Annex III."]
[]
["Other notes (optional):"]
[]
[]
[]
["Test Methods and Analysis"]
[]
["Parameter","Unit","Test specified in 2009/30/EC or EN228:2008",null,null,null,null,null,null,"Notes on exceedences"]
[null,null,"Method","Date","Reproducability, R","Tolerance limits",null,null,null,"Sample location (S,T or R)","Values","Details/action taken"]
[null,null,null,null,null,"Minimum","Maximum","Exceeded?"]
[{"$f":"'Methods&Limits'!A9","v":"Research Octane Number (RON)"},{"$f":"'Methods&Limits'!B9","v":"--"},{"$f":"'Methods&Limits'!E9","v":"EN-ISO 5164"},{"$f":"'Methods&Limits'!F9","v":2014},{"$f":"'Methods&Limits'!G9","v":0.7},{"$f":"'Methods&Limits'!H9","v":94.587000000000003},null,{"$f":"IF(D17=\"\",\"\",IF(D17<F62,\"Yes\",\"\"))","v":"Yes"}]
[{"$f":"'Methods&Limits'!A10","v":"(RON 91 fuel only)"},{"$f":"'Methods&Limits'!B10","v":"--"},{"$f":"'Methods&Limits'!E10","v":"EN-ISO 5164"},{"$f":"'Methods&Limits'!F10","v":2014},{"$f":"'Methods&Limits'!G10","v":0.7},{"$f":"'Methods&Limits'!H10","v":90.587000000000003},null,{"$f":"IF(D17=\"\",\"\",IF(D17<F63,\"Yes\",\"\"))","v":"Yes"}]
[{"$f":"'Methods&Limits'!A11","v":"Motor Octane Number (MON)"},{"$f":"'Methods&Limits'!B11","v":"--"},{"$f":"'Methods&Limits'!E11","v":"EN-ISO 5163"},{"$f":"'Methods&Limits'!F11","v":2014},{"$f":"'Methods&Limits'!G11","v":0.9},{"$f":"'Methods&Limits'!H11","v":84.468999999999994},null,{"$f":"IF(D18=\"\",\"\",IF(D18<F64,\"Yes\",\"\"))","v":"Yes"}]
[{"$f":"'Methods&Limits'!A12","v":"(RON 91 fuel only)"},{"$f":"'Methods&Limits'!B12","v":"--"},{"$f":"'Methods&Limits'!E12","v":"EN-ISO 5163"},{"$f":"'Methods&Limits'!F12","v":2014},{"$f":"'Methods&Limits'!G12","v":0.9},{"$f":"'Methods&Limits'!H12","v":80.468999999999994},null,{"$f":"IF(D18=\"\",\"\",IF(D18<F65,\"Yes\",\"\"))","v":"Yes"}]
[{"$f":"'Methods&Limits'!A13","v":"Vapour Pressure, DVPE"}]
[{"$f":"'Methods&Limits'!A14","v":"--summer period (normal)"},{"$f":"'Methods&Limits'!B14","v":"kPa"},{"$f":"'Methods&Limits'!E14","v":"EN 13016-1"},{"$f":"'Methods&Limits'!F14","v":2018},{"$f":"'Methods&Limits'!G14","v":2.2000000000000002},null,{"$f":"'Methods&Limits'!I14","v":61.298000000000002}]
[{"$f":"'Methods&Limits'!A15","v":"-- Petrol with bioethanol content 0-2"},{"$f":"'Methods&Limits'!B15","v":"kPa"},{"$f":"'Methods&Limits'!E15","v":"EN 1601"},{"$f":"'Methods&Limits'!F15","v":2017},{"$f":"'Methods&Limits'!G15","v":2.2999999999999998},null,{"$f":"'Methods&Limits'!I15","v":67.307000000000002}]
[{"$f":"'Methods&Limits'!A16","v":"-- Petrol with bioethanol content 2-4"},{"$f":"'Methods&Limits'!B16","v":"kPa"},{"$f":"'Methods&Limits'!E16","v":"EN 1601"},{"$f":"'Methods&Limits'!F16","v":2017},{"$f":"'Methods&Limits'!G16","v":2.2999999999999998},null,{"$f":"'Methods&Limits'!I16","v":69.156999999999996}]
[{"$f":"'Methods&Limits'!A17","v":"-- Petrol with bioethanol content 4-6"},{"$f":"'Methods&Limits'!B17","v":"kPa"},{"$f":"'Methods&Limits'!E17","v":"EN 1601"},{"$f":"'Methods&Limits'!F17","v":2017},{"$f":"'Methods&Limits'!G17","v":2.2999999999999998},null,{"$f":"'Methods&Limits'!I17","v":69.356999999999999}]
[{"$f":"'Methods&Limits'!A18","v":"-- Petrol with bioethanol content 6-8"},{"$f":"'Methods&Limits'!B18","v":"kPa"},{"$f":"'Methods&Limits'!E18","v":"EN 1601"},{"$f":"'Methods&Limits'!F18","v":2017},{"$f":"'Methods&Limits'!G18","v":2.2999999999999998},null,{"$f":"'Methods&Limits'!I18","v":69.236999999999995}]
[{"$f":"'Methods&Limits'!A19","v":"-- Petrol with bioethanol content 8-10"},{"$f":"'Methods&Limits'!B19","v":"kPa"},{"$f":"'Methods&Limits'!E19","v":"EN 1601"},{"$f":"'Methods&Limits'!F19","v":2017},{"$f":"'Methods&Limits'!G19","v":2.2999999999999998},null,{"$f":"'Methods&Limits'!I19","v":69.117000000000004}]
[{"$f":"'Methods&Limits'!A20","v":"--summer period (arctic or severe weather conditions)"},{"$f":"'Methods&Limits'!B20","v":"kPa"},{"$f":"'Methods&Limits'!E20","v":"EN 13016-1"},{"$f":"'Methods&Limits'!F20","v":2018},{"$f":"'Methods&Limits'!G20","v":2.2999999999999998},null,{"$f":"'Methods&Limits'!I20","v":71.356999999999999}]
[{"$f":"'Methods&Limits'!A21","v":"Distillation *"}]
[{"$f":"'Methods&Limits'!A22","v":"--evaporated at 100 oC"},{"$f":"'Methods&Limits'!B22","v":"% V/V"},{"$f":"'Methods&Limits'!E22","v":"EN-ISO 3405"},{"$f":"'Methods&Limits'!F22","v":2020},{"$f":"'Methods&Limits'!G22","v":4},{"$f":"'Methods&Limits'!H22","v":43.64},null,{"$f":"IF(D22=\"\",\"\",IF(D22<F75,\"Yes\",\"\"))","v":"Yes"}]
[{"$f":"'Methods&Limits'!A23","v":"-- evaporated at 150 oC "},{"$f":"'Methods&Limits'!B23","v":"% V/V"},{"$f":"'Methods&Limits'!E23","v":"EN-ISO 3405"},{"$f":"'Methods&Limits'!F23","v":2020},{"$f":"'Methods&Limits'!G23","v":4},{"$f":"'Methods&Limits'!H23","v":72.64},null,{"$f":"IF(D23=\"\",\"\",IF(D23<F76,\"Yes\",\"\"))","v":"Yes"}]
[{"$f":"'Methods&Limits'!A24","v":"Hydrocarbon analysis"},null,null,null,null,null,null,{"$f":"IF(D24<F77,\"Yes\",\"\")","v":""}]
[{"$f":"'Methods&Limits'!A25","v":"-- Olefins"},{"$f":"'Methods&Limits'!B25","v":"% V/V"},{"$f":"'Methods&Limits'!E25","v":"EN 15553"},{"$f":"'Methods&Limits'!F25","v":2021},{"$f":"'Methods&Limits'!G25","v":6.4},null,{"$f":"'Methods&Limits'!I25","v":21.776},{"$f":"IF($E$25>G78,\"Yes\",\"\")","v":""}]
[null,null,{"$f":"'Methods&Limits'!E26","v":"EN-ISO 22854"},{"$f":"'Methods&Limits'!F26","v":2021},{"$f":"'Methods&Limits'!G26","v":2.6},null,{"$f":"'Methods&Limits'!I26","v":19.533999999999999},{"$f":"IF($E$25>G79,\"Yes\",\"\")","v":""}]
[{"$f":"'Methods&Limits'!A27","v":"*without oxygenates"},null,{"$f":"'Methods&Limits'!E27","v":"EN 15553"},{"$f":"'Methods&Limits'!F27","v":2021},{"$f":"'Methods&Limits'!G27","v":"-"},null,{"$f":"'Methods&Limits'!I27","v":"-"},{"$f":"IF($E$25>G80,\"Yes\",\"\")","v":""}]
[null,null,{"$f":"'Methods&Limits'!E28","v":"EN-ISO 22854"},{"$f":"'Methods&Limits'!F28","v":2021},{"$f":"'Methods&Limits'!G28","v":"-"},null,{"$f":"'Methods&Limits'!I28","v":"-"},{"$f":"IF($E$25>G81,\"Yes\",\"\")","v":""}]
[{"$f":"'Methods&Limits'!A29","v":"-- Olefins (RON 91 fuel only)***"},{"$f":"'Methods&Limits'!B29","v":"% V/V"},{"$f":"'Methods&Limits'!E29","v":"ASTM D1319"},{"$f":"'Methods&Limits'!F29","v":2020},{"$f":"'Methods&Limits'!G29","v":5.0999999999999996},null,{"$f":"'Methods&Limits'!I29","v":24.009},{"$f":"IF($E$25>G82,\"Yes\",\"\")","v":""}]
[{"$f":"'Methods&Limits'!A30","v":"-- Aromatics (from 2005)"},null,{"$f":"'Methods&Limits'!E30","v":"EN-ISO 22854"},{"$f":"'Methods&Limits'!F30","v":2021},{"$f":"'Methods&Limits'!G30","v":1.7},null,{"$f":"'Methods&Limits'!I30","v":36.003},{"$f":"IF($E$26>G83,\"Yes\",\"\")","v":""}]
[{"$f":"'Methods&Limits'!A31","v":"-- Benzene"},{"$f":"'Methods&Limits'!B31","v":"% V/V"},{"$f":"'Methods&Limits'!E31","v":"EN 12177"},{"$f":"'Methods&Limits'!F31","v":2022},{"$f":"'Methods&Limits'!G31","v":0.1},null,{"$f":"'Methods&Limits'!I31","v":1.0589999999999999},{"$f":"IF(E27>G84,\"Yes\",\"\")","v":""}]
[null,null,{"$f":"'Methods&Limits'!E32","v":"EN 238"},{"$f":"'Methods&Limits'!F32","v":1996},{"$f":"'Methods&Limits'!G32","v":0.17},null,{"$f":"'Methods&Limits'!I32","v":1.1003000000000001},{"$f":"IF(E27>G85,\"Yes\",\"\")","v":""}]
[null,null,{"$f":"'Methods&Limits'!E33","v":"EN-ISO 22854"},{"$f":"'Methods&Limits'!F33","v":2021},{"$f":"'Methods&Limits'!G33","v":0.05},null,{"$f":"'Methods&Limits'!I33","v":1.0295000000000001},{"$f":"IF(E27>G86,\"Yes\",\"\")","v":""}]
[{"$f":"'Methods&Limits'!A34","v":"Oxygen content"},{"$f":"'Methods&Limits'!B34","v":"% (m/m)"},{"$f":"'Methods&Limits'!E34","v":"EN 1601"},{"$f":"'Methods&Limits'!F34","v":2017},{"$f":"'Methods&Limits'!G34","v":0.41},null,{"$f":"'Methods&Limits'!I34","v":3.9419},{"$f":"IF(E28>G87,\"Yes\",\"\")","v":""}]
[null,null,{"$f":"'Methods&Limits'!E35","v":"EN 1601"},{"$f":"'Methods&Limits'!F35","v":2017},{"$f":"'Methods&Limits'!G35","v":0.41},null,{"$f":"'Methods&Limits'!I35","v":2.9419},{"$f":"IF(E29>G88,\"Yes\",\"\")","v":""}]
[{"$f":"'Methods&Limits'!A36","v":"Oxygenates"}]
[{"$f":"'Methods&Limits'!A37","v":"-- Methanol"},{"$f":"'Methods&Limits'!B37","v":"% V/V"},{"$f":"'Methods&Limits'!E37","v":"EN 1601"},{"$f":"'Methods&Limits'!F37","v":2017},{"$f":"'Methods&Limits'!G37","v":0.3},null,{"$f":"'Methods&Limits'!I37","v":3.177},{"$f":"IF(E31>G90,\"Yes\",\"\")","v":""}]
[{"$f":"'Methods&Limits'!A38","v":"-- Ethanol"},{"$f":"'Methods&Limits'!B38","v":"% V/V"},{"$f":"'Methods&Limits'!E38","v":"EN 1601"},{"$f":"'Methods&Limits'!F38","v":2017},{"$f":"'Methods&Limits'!G38","v":0.8},null,{"$f":"'Methods&Limits'!I38","v":10.472},""]
[{"$f":"'Methods&Limits'!A39","v":"-- Iso-propyl alcohol"},{"$f":"'Methods&Limits'!B39","v":"% V/V"},{"$f":"'Methods&Limits'!E39","v":"EN 1601"},{"$f":"'Methods&Limits'!F39","v":2017},{"$f":"'Methods&Limits'!G39","v":0.9},null,{"$f":"'Methods&Limits'!I39","v":12.531000000000001},""]
[{"$f":"'Methods&Limits'!A40","v":"-- Tert-butyl alcohol"},{"$f":"'Methods&Limits'!B40","v":"% V/V"},{"$f":"'Methods&Limits'!E40","v":"EN 1601"},{"$f":"'Methods&Limits'!F40","v":2017},{"$f":"'Methods&Limits'!G40","v":1},null,{"$f":"'Methods&Limits'!I40","v":15.59},""]
[{"$f":"'Methods&Limits'!A41","v":"-- Iso-butyl alcohol"},{"$f":"'Methods&Limits'!B41","v":"% V/V"},{"$f":"'Methods&Limits'!E41","v":"EN 1601"},{"$f":"'Methods&Limits'!F41","v":2017},{"$f":"'Methods&Limits'!G41","v":1},null,{"$f":"'Methods&Limits'!I41","v":15.59},""]
[{"$f":"'Methods&Limits'!A42","v":"-- Ethers with 5 or more carbon atoms per molecule"},{"$f":"'Methods&Limits'!B42","v":"% V/V"},{"$f":"'Methods&Limits'!E42","v":"EN 1601"},{"$f":"'Methods&Limits'!F42","v":2017},{"$f":"'Methods&Limits'!G42","v":1},null,{"$f":"'Methods&Limits'!I42","v":22.59},""]
[{"$f":"'Methods&Limits'!A43","v":"-- other oxygenates"},{"$f":"'Methods&Limits'!B43","v":"% V/V"},{"$f":"'Methods&Limits'!E43","v":"EN 1601"},{"$f":"'Methods&Limits'!F43","v":2017},{"$f":"'Methods&Limits'!G43","v":1},null,{"$f":"'Methods&Limits'!I43","v":15.59},""]
[{"$f":"'Methods&Limits'!A44","v":"Oxygen content"},{"$f":"'Methods&Limits'!B44","v":"% (m/m)"},{"$f":"'Methods&Limits'!E44","v":"EN 13132"},{"$f":"'Methods&Limits'!F44","v":2002},{"$f":"'Methods&Limits'!G44","v":0.3},null,{"$f":"'Methods&Limits'!I44","v":3.8770000000000002},{"$f":"IF(E28>G97,\"Yes\",\"\")","v":""}]
[null,null,{"$f":"'Methods&Limits'!E45","v":"EN 13132"},{"$f":"'Methods&Limits'!F45","v":2002},{"$f":"'Methods&Limits'!G45","v":0.3},null,{"$f":"'Methods&Limits'!I45","v":2.8770000000000002},{"$f":"IF(E29>G98,\"Yes\",\"\")","v":""}]
[{"$f":"'Methods&Limits'!A46","v":"Oxygenates"}]
[{"$f":"'Methods&Limits'!A47","v":"-- Methanol"},{"$f":"'Methods&Limits'!B47","v":"% V/V"},{"$f":"'Methods&Limits'!E47","v":"EN 13132"},{"$f":"'Methods&Limits'!F47","v":2002},{"$f":"'Methods&Limits'!G47","v":0.3},null,{"$f":"'Methods&Limits'!I47","v":3.177},{"$f":"IF(E31>G100,\"Yes\",\"\")","v":""}]
[{"$f":"'Methods&Limits'!A48","v":"-- Ethanol"},{"$f":"'Methods&Limits'!B48","v":"% V/V"},{"$f":"'Methods&Limits'!E48","v":"EN 13132"},{"$f":"'Methods&Limits'!F48","v":2002},{"$f":"'Methods&Limits'!G48","v":0.8},null,{"$f":"'Methods&Limits'!I48","v":10.472},""]
[{"$f":"'Methods&Limits'!A49","v":"-- Iso-propyl alcohol"},{"$f":"'Methods&Limits'!B49","v":"% V/V"},{"$f":"'Methods&Limits'!E49","v":"EN 13132"},{"$f":"'Methods&Limits'!F49","v":2002},{"$f":"'Methods&Limits'!G49","v":0.8},null,{"$f":"'Methods&Limits'!I49","v":12.472},""]
[{"$f":"'Methods&Limits'!A50","v":"-- Tert-butyl alcohol"},{"$f":"'Methods&Limits'!B50","v":"% V/V"},{"$f":"'Methods&Limits'!E50","v":"EN 13132"},{"$f":"'Methods&Limits'!F50","v":2002},{"$f":"'Methods&Limits'!G50","v":1},null,{"$f":"'Methods&Limits'!I50","v":15.59},""]
[{"$f":"'Methods&Limits'!A51","v":"-- Iso-butyl alcohol"},{"$f":"'Methods&Limits'!B51","v":"% V/V"},{"$f":"'Methods&Limits'!E51","v":"EN 13132"},{"$f":"'Methods&Limits'!F51","v":2002},{"$f":"'Methods&Limits'!G51","v":1},null,{"$f":"'Methods&Limits'!I51","v":15.59},""]
[{"$f":"'Methods&Limits'!A52","v":"-- Ethers with 5 or more carbon atoms per molecule"},{"$f":"'Methods&Limits'!B52","v":"% V/V"},{"$f":"'Methods&Limits'!E52","v":"EN 13132"},{"$f":"'Methods&Limits'!F52","v":2002},{"$f":"'Methods&Limits'!G52","v":1},null,{"$f":"'Methods&Limits'!I52","v":22.59},""]
[{"$f":"'Methods&Limits'!A53","v":"-- other oxygenates"},{"$f":"'Methods&Limits'!B53","v":"% V/V"},{"$f":"'Methods&Limits'!E53","v":"EN 13132"},{"$f":"'Methods&Limits'!F53","v":2002},{"$f":"'Methods&Limits'!G53","v":1},null,{"$f":"'Methods&Limits'!I53","v":15.59},""]
[{"$f":"'Methods&Limits'!A54","v":"Oxygen content"},{"$f":"'Methods&Limits'!B54","v":"% (m/m)"},{"$f":"'Methods&Limits'!E54","v":"EN-ISO 22854"},{"$f":"'Methods&Limits'!F54","v":2021},{"$f":"'Methods&Limits'!G54","v":0.4},null,{"$f":"'Methods&Limits'!I54","v":3.9359999999999999},{"$f":"IF(E28>G107,\"Yes\",\"\")","v":""}]
[null,null,{"$f":"'Methods&Limits'!E55","v":"EN-ISO 22854"},{"$f":"'Methods&Limits'!F55","v":2021},{"$f":"'Methods&Limits'!G55","v":0.4},null,{"$f":"'Methods&Limits'!I55","v":2.9359999999999999},{"$f":"IF(E29>G108,\"Yes\",\"\")","v":""}]
[{"$f":"'Methods&Limits'!A56","v":"Oxyginates"}]
[{"$f":"'Methods&Limits'!A57","v":"-- Methanol"},{"$f":"'Methods&Limits'!B57","v":"% V/V"},{"$f":"'Methods&Limits'!E57","v":"EN-ISO 22854"},{"$f":"'Methods&Limits'!F57","v":2021},{"$f":"'Methods&Limits'!G57","v":0.4},null,{"$f":"'Methods&Limits'!I57","v":3.2359999999999998},{"$f":"IF(E31>G110,\"Yes\",\"\")","v":""}]
[{"$f":"'Methods&Limits'!A58","v":"-- Ethanol"},{"$f":"'Methods&Limits'!B58","v":"% V/V"},{"$f":"'Methods&Limits'!E58","v":"EN-ISO 22854"},{"$f":"'Methods&Limits'!F58","v":2021},{"$f":"'Methods&Limits'!G58","v":0.6},null,{"$f":"'Methods&Limits'!I58","v":10.353999999999999},""]
[{"$f":"'Methods&Limits'!A59","v":"-- Iso-propyl alcohol"},{"$f":"'Methods&Limits'!B59","v":"% V/V"},{"$f":"'Methods&Limits'!E59","v":"EN-ISO 22854"},{"$f":"'Methods&Limits'!F59","v":2021},{"$f":"'Methods&Limits'!G59","v":0.7},null,{"$f":"'Methods&Limits'!I59","v":12.413},""]
[{"$f":"'Methods&Limits'!A60","v":"-- Tert-butyl alcohol"},{"$f":"'Methods&Limits'!B60","v":"% V/V"},{"$f":"'Methods&Limits'!E60","v":"EN-ISO 22854"},{"$f":"'Methods&Limits'!F60","v":2021},{"$f":"'Methods&Limits'!G60","v":0.7},null,{"$f":"'Methods&Limits'!I60","v":15.413},""]
[{"$f":"'Methods&Limits'!A61","v":"-- Iso-butyl alcohol"},{"$f":"'Methods&Limits'!B61","v":"% V/V"},{"$f":"'Methods&Limits'!E61","v":"EN-ISO 22854"},{"$f":"'Methods&Limits'!F61","v":2021},{"$f":"'Methods&Limits'!G61","v":0.7},null,{"$f":"'Methods&Limits'!I61","v":15.413},""]
[{"$f":"'Methods&Limits'!A62","v":"-- Ethers with 5 or more carbon atoms per molecule"},{"$f":"'Methods&Limits'!B62","v":"% V/V"},{"$f":"'Methods&Limits'!E62","v":"EN-ISO 22854"},{"$f":"'Methods&Limits'!F62","v":2021},{"$f":"'Methods&Limits'!G62","v":0.9},null,{"$f":"'Methods&Limits'!I62","v":22.530999999999999},""]
[{"$f":"'Methods&Limits'!A63","v":"-- other oxygenates"},{"$f":"'Methods&Limits'!B63","v":"% V/V"},{"$f":"'Methods&Limits'!E63","v":"EN-ISO 22854"},{"$f":"'Methods&Limits'!F63","v":2021},{"$f":"'Methods&Limits'!G63","v":0.7},null,{"$f":"'Methods&Limits'!I63","v":15.413},""]
[{"$f":"'Methods&Limits'!A64:A64","v":"Sulphur content (sulphur free, from 2005)**"},{"$f":"'Methods&Limits'!B64","v":"mg/kg"},{"$f":"'Methods&Limits'!E64","v":"EN-ISO 14596"},{"$f":"'Methods&Limits'!F64","v":2018},{"$f":"'Methods&Limits'!G64","v":5},null,{"$f":"'Methods&Limits'!I64","v":12.95},{"$f":"IF(E$38>G117,\"Yes\",\"\")","v":""}]
[null,null,{"$f":"'Methods&Limits'!E65","v":"EN 24260"},{"$f":"'Methods&Limits'!F65","v":1994},{"$f":"'Methods&Limits'!G65","v":1},null,{"$f":"'Methods&Limits'!I65","v":10.59},{"$f":"IF(E$38>G118,\"Yes\",\"\")","v":""}]
[null,null,{"$f":"'Methods&Limits'!E66","v":"EN-ISO 20846"},{"$f":"'Methods&Limits'!F66","v":2019},{"$f":"'Methods&Limits'!G66","v":2.7},null,{"$f":"'Methods&Limits'!I66","v":11.593},{"$f":"IF(E$38>G119,\"Yes\",\"\")","v":""}]
[null,null,{"$f":"'Methods&Limits'!E67","v":"EN-ISO 20884"},{"$f":"'Methods&Limits'!F67","v":2019},{"$f":"'Methods&Limits'!G67","v":3.1},null,{"$f":"'Methods&Limits'!I67","v":11.829000000000001},{"$f":"IF(E$38>G120,\"Yes\",\"\")","v":""}]
[{"$f":"'Methods&Limits'!A68:A68","v":"Lead content"},{"$f":"'Methods&Limits'!B68","v":"g/l"},{"$f":"'Methods&Limits'!E68","v":"EN 237"},{"$f":"'Methods&Limits'!F68","v":2004},{"$f":"'Methods&Limits'!G68","v":6.1999999999999998E-3},null,{"$f":"'Methods&Limits'!I68","v":8.657999999999999E-3},{"$f":"IF($E$39>G121,\"Yes\",\"\")","v":""}]

{"sheet":"Petrol (3+4)","index":18,"n_rows":121,"n_cols":18,"rows_kept":121,"cut":false,"hidden":false,"merged":[[2,1,2,4],[2,6,9,16],[3,1,3,4],[4,1,4,4],[5,1,5,4],[6,1,6,4],[7,2,7,4],[13,2,14,10],[13,11,13,14],[13,15,13,16],[14,11,14,12],[14,13,14,14],[14,15,14,16],[58,2,58,8],[58,9,58,12],[20,15,22,15],[27,15,28,15],[27,16,28,16],[43,0,43,3],[44,4,45,11],[46,4,46,11],[47,4,47,11],[48,4,48,11],[49,4,49,11],[50,4,50,11],[53,0,53,11],[71,11,71,12],[59,5,59,6],[59,9,60,9],[61,11,61,12],[62,11,62,12],[63,11,63,12],[64,11,64,12],[66,11,66,12],[67,11,67,12],[68,11,68,12],[69,11,69,12],[70,11,70,12],[59,11,59,12],[85,11,85,12],[72,11,72,12],[74,11,74,12],[75,11,75,12],[77,11,77,12],[78,11,78,12],[79,11,79,12],[80,11,80,12],[81,11,81,12],[82,11,82,12],[83,11,83,12],[84,11,84,12],[99,11,99,12],[86,11,86,12],[87,11,87,12],[89,11,89,12],[90,11,90,12],[91,11,91,12],[92,11,92,12],[93,11,93,12],[94,11,94,12],[95,11,95,12],[96,11,96,12],[97,11,97,12],[112,11,112,12],[100,11,100,12],[101,11,101,12],[102,11,102,12],[103,11,103,12],[104,11,104,12],[105,11,105,12],[106,11,106,12],[107,11,107,12],[109,11,109,12],[110,11,110,12],[111,11,111,12],[119,11,119,12],[120,11,120,12],[121,11,121,12],[122,11,122,12],[113,11,113,12],[114,11,114,12],[115,11,115,12],[116,11,116,12],[117,11,117,12],[118,11,118,12]]}
["Market Fuels used in Vehicles with Spark Ignition Engines (Petrol)",null,null,null,null,null,null,null,null,null,null,null,null,null,null,null,null,"<-- GO BACK"]
[]
["Country",{"$f":"IF(LEN('Contacts&Annual Summary'!C9) > 1,'Contacts&Annual Summary'!C9,\"\")","v":""},null,null,null,null,"Notes on completing the tables\nThe table structure has been locked to prevent modification - data can be copied and pasted, in bulk into the Reporting Results blue table cells.  Where a white row exists between rows, it will not be possible to paste over white rows and sections should be pasted separately.\n\nColumn H in the Test Methods and Analysis table is set to automatically check whether the values entered in the Reporting Results table exceed maximum or minimum Tolerance Limits.  If any exceedance is detected, please provide details in the columns to the right including the number of samples, location samples were taken from, Values and Details of any action taken to address non-compliant samples.  Compliance information is verified manually and this automated compliance check is not solely relied upon during data analysis.\n\nPlease do not unlock this template - modified templates cannot be processed and may delay reporting."]
["Reporting Year",{"$f":"'Contacts&Annual Summary'!C8","v":2023}]
["Period (Summer or Winter)","Full Year"]
["Parent fuel grade","Petrol"]
["National fuel grade",{"$f":"'Petrol (3)'!B7","v":0}]
["Summer Period (N or A)*",0,{"$f":"IF( B8=\"A\",\"1st June to 31st August (arctic)\",\"1st May to 30th September (normal)\")","v":"1st May to 30th September (normal)"}]
["The maximum bioethanol content (% v/v)",{"$f":"MAX('Petrol (3)'!B9,'Petrol (4)'!B9)","v":0},"Please include the bioethanol content as a numerical figure in % V/V"]
["* N = 1st May to 30th September (normal) ; A = 1st June to 31st August (arctic)."]
[]
["Reporting results"]
[]
["Parameter","Unit","Analytical and statistical results \n(Please see an explanation and examples for new columns/ information required in Cells I15 to K37 on the Introduction & Instructions tab).",null,null,null,null,null,null,null,null,"Limiting Value (1)",null,null,null,"Test method"]
[null,null,null,null,null,null,null,null,null,null,null,"National Specification, if any",null,"According to Directive 2009/30/EC",null,"(more recent versions may also be used)"]
[null,null,"No Samples","Minimum","Maximum","Median","Mean","Standard Deviation","No Samples outside 95% tolerance limit","25% of Sample Value","75% of Sample Value","Minimum","Maximum","Minimum","Maximum","Method","Date"]
["Research Octane Number","--",{"$f":"IF(AND('Petrol (3)'!C17=\"\",'Petrol (4)'!C17=\"\"),\"\",'Petrol (3)'!C17+'Petrol (4)'!C17)","v":0},{"$f":"IF(AND('Petrol (3)'!D17=\"\",'Petrol (4)'!D17=\"\"),\"\",MIN('Petrol (3)'!D17,'Petrol (4)'!D17))","v":0},{"$f":"IF(AND('Petrol (3)'!E17=\"\",'Petrol (4)'!E17=\"\"),\"\",MAX('Petrol (3)'!E17,'Petrol (4)'!E17))","v":0},0,0,0,{"$f":"IF(AND('Petrol (3)'!I17=\"\",'Petrol (4)'!I17=\"\"),\"\",'Petrol (3)'!I17+'Petrol (4)'!I17)","v":0},0,0,null,null,"95 (2)",null,"EN-ISO 5164",2005]
["Motor Octane Number","--",{"$f":"IF(AND('Petrol (3)'!C18=\"\",'Petrol (4)'!C18=\"\"),\"\",'Petrol (3)'!C18+'Petrol (4)'!C18)","v":0},{"$f":"IF(AND('Petrol (3)'!D18=\"\",'Petrol (4)'!D18=\"\"),\"\",MIN('Petrol (3)'!D18,'Petrol (4)'!D18))","v":0},{"$f":"IF(AND('Petrol (3)'!E18=\"\",'Petrol (4)'!E18=\"\"),\"\",MAX('Petrol (3)'!E18,'Petrol (4)'!E18))","v":0},0,0,0,{"$f":"IF(AND('Petrol (3)'!I18=\"\",'Petrol (4)'!I18=\"\"),\"\",'Petrol (3)'!I18+'Petrol (4)'!I18)","v":0},0,0,null,null,"85 (3)",null,"EN-ISO 5163",2005]
["Vapour Pressure, DVPE (6)","kPa",null,null,null,null,null,null,null,null,null,null,null,null,"(4)"]
["-- required for summer period only",null,{"$f":"IF(AND('Petrol (3)'!C20=\"\",'Petrol (4)'!C20=\"\"),\"\",'Petrol (3)'!C20+'Petrol (4)'!C20)","v":0},{"$f":"IF(AND('Petrol (3)'!D20=\"\",'Petrol (4)'!D20=\"\"),\"\",MIN('Petrol (3)'!D20,'Petrol (4)'!D20))","v":0},{"$f":"IF(AND('Petrol (3)'!E20=\"\",'Petrol (4)'!E20=\"\"),\"\",MAX('Petrol (3)'!E20,'Petrol (4)'!E20))","v":0},0,0,0,{"$f":"IF(AND('Petrol (3)'!I20=\"\",'Petrol (4)'!I20=\"\"),\"\",'Petrol (3)'!I20+'Petrol (4)'!I20)","v":0},0,0,null,null,null,{"$f":"IF(E8=\"A\",70,60)","v":60},"EN 13106-1",2007]
["Distillation",null,null,null,null,null,null,null,null,null,null,null,null,null,null,"EN-ISO 3405"]
["-- evaporated at 100 oC","% V/V",{"$f":"IF(AND('Petrol (3)'!C22=\"\",'Petrol (4)'!C22=\"\"),\"\",'Petrol (3)'!C22+'Petrol (4)'!C22)","v":0},{"$f":"IF(AND('Petrol (3)'!D22=\"\",'Petrol (4)'!D22=\"\"),\"\",MIN('Petrol (3)'!D22,'Petrol (4)'!D22))","v":0},{"$f":"IF(AND('Petrol (3)'!E22=\"\",'Petrol (4)'!E22=\"\"),\"\",MAX('Petrol (3)'!E22,'Petrol (4)'!E22))","v":0},0,0,0,{"$f":"IF(AND('Petrol (3)'!I22=\"\",'Petrol (4)'!I22=\"\"),\"\",'Petrol (3)'!I22+'Petrol (4)'!I22)","v":0},0,0,null,null,46,null,null,2000]
["-- evaporated at 150 oC ","% V/V",{"$f":"IF(AND('Petrol (3)'!C23=\"\",'Petrol (4)'!C23=\"\"),\"\",'Petrol (3)'!C23+'Petrol (4)'!C23)","v":0},{"$f":"IF(AND('Petrol (3)'!D23=\"\",'Petrol (4)'!D23=\"\"),\"\",MIN('Petrol (3)'!D23,'Petrol (4)'!D23))","v":0},{"$f":"IF(AND('Petrol (3)'!E23=\"\",'Petrol (4)'!E23=\"\"),\"\",MAX('Petrol (3)'!E23,'Petrol (4)'!E23))","v":0},0,0,0,{"$f":"IF(AND('Petrol (3)'!I23=\"\",'Petrol (4)'!I23=\"\"),\"\",'Petrol (3)'!I23+'Petrol (4)'!I23)","v":0},0,0,null,null,75]
["Hydrocarbon analysis"]
["-- Olefins","% V/V",{"$f":"IF(AND('Petrol (3)'!C25=\"\",'Petrol (4)'!C25=\"\"),\"\",'Petrol (3)'!C25+'Petrol (4)'!C25)","v":0},{"$f":"IF(AND('Petrol (3)'!D25=\"\",'Petrol (4)'!D25=\"\"),\"\",MIN('Petrol (3)'!D25,'Petrol (4)'!D25))","v":0},{"$f":"IF(AND('Petrol (3)'!E25=\"\",'Petrol (4)'!E25=\"\"),\"\",MAX('Petrol (3)'!E25,'Petrol (4)'!E25))","v":0},0,0,0,{"$f":"IF(AND('Petrol (3)'!I25=\"\",'Petrol (4)'!I25=\"\"),\"\",'Petrol (3)'!I25+'Petrol (4)'!I25)","v":0},0,0,null,null,null,"18.0 (5)","ASTM D 1319\nEN 15553\nEN-ISO 22854","1995\n2007\n2008"]
["-- Aromatics","% V/V",{"$f":"IF(AND('Petrol (3)'!C26=\"\",'Petrol (4)'!C26=\"\"),\"\",'Petrol (3)'!C26+'Petrol (4)'!C26)","v":0},{"$f":"IF(AND('Petrol (3)'!D26=\"\",'Petrol (4)'!D26=\"\"),\"\",MIN('Petrol (3)'!D26,'Petrol (4)'!D26))","v":0},{"$f":"IF(AND('Petrol (3)'!E26=\"\",'Petrol (4)'!E26=\"\"),\"\",MAX('Petrol (3)'!E26,'Petrol (4)'!E26))","v":0},0,0,0,{"$f":"IF(AND('Petrol (3)'!I26=\"\",'Petrol (4)'!I26=\"\"),\"\",'Petrol (3)'!I26+'Petrol (4)'!I26)","v":0},0,0,null,null,null,35,"EN-ISO 22854","1995\n2008"]
["-- Benzene","% V/V",{"$f":"IF(AND('Petrol (3)'!C27=\"\",'Petrol (4)'!C27=\"\"),\"\",'Petrol (3)'!C27+'Petrol (4)'!C27)","v":0},{"$f":"IF(AND('Petrol (3)'!D27=\"\",'Petrol (4)'!D27=\"\"),\"\",MIN('Petrol (3)'!D27,'Petrol (4)'!D27))","v":0},{"$f":"IF(AND('Petrol (3)'!E27=\"\",'Petrol (4)'!E27=\"\"),\"\",MAX('Petrol (3)'!E27,'Petrol (4)'!E27))","v":0},0,0,0,{"$f":"IF(AND('Petrol (3)'!I27=\"\",'Petrol (4)'!I27=\"\"),\"\",'Petrol (3)'!I27+'Petrol (4)'!I27)","v":0},0,0,null,null,null,1,"EN 238\nEN 12177\nEN-ISO 22854","1996\n1998\n2008"]
[{"$f":"IF(C29>0,\"Do not complete\",\"Oxygen content\")","v":"Oxygen content"},"% (m/m)",{"$f":"IF(AND('Petrol (3)'!C28=\"\",'Petrol (4)'!C28=\"\"),\"\",'Petrol (3)'!C28+'Petrol (4)'!C28)","v":0},{"$f":"IF(AND('Petrol (3)'!D28=\"\",'Petrol (4)'!D28=\"\"),\"\",MIN('Petrol (3)'!D28,'Petrol (4)'!D28))","v":0},{"$f":"IF(AND('Petrol (3)'!E28=\"\",'Petrol (4)'!E28=\"\"),\"\",MAX('Petrol (3)'!E28,'Petrol (4)'!E28))","v":0},0,0,0,{"$f":"IF(AND('Petrol (3)'!I28=\"\",'Petrol (4)'!I28=\"\"),\"\",'Petrol (3)'!I28+'Petrol (4)'!I28)","v":0},0,0,null,null,null,3.7,"EN 1601\nEN 13132\nEN-ISO 22854","1997\n2000\n2008"]
[{"$f":"IF(C28>0,\"Do not complete\",\"Oxygen content*\n*petrol with 5% (v/v) or less ethanol content\")","v":"Oxygen content*\n*petrol with 5% (v/v) or less ethanol content"},"% (m/m)",{"$f":"IF(AND('Petrol (3)'!C29=\"\",'Petrol (4)'!C29=\"\"),\"\",'Petrol (3)'!C29+'Petrol (4)'!C29)","v":0},{"$f":"IF(AND('Petrol (3)'!D29=\"\",'Petrol (4)'!D29=\"\"),\"\",MIN('Petrol (3)'!D29,'Petrol (4)'!D29))","v":0},{"$f":"IF(AND('Petrol (3)'!E29=\"\",'Petrol (4)'!E29=\"\"),\"\",MAX('Petrol (3)'!E29,'Petrol (4)'!E29))","v":0},0,0,0,{"$f":"IF(AND('Petrol (3)'!I29=\"\",'Petrol (4)'!I29=\"\"),\"\",'Petrol (3)'!I29+'Petrol (4)'!I29)","v":0},0,0,null,null,null,2.7]
["Oxygenates"]
["-- Methanol","% V/V",{"$f":"IF(AND('Petrol (3)'!C31=\"\",'Petrol (4)'!C31=\"\"),\"\",'Petrol (3)'!C31+'Petrol (4)'!C31)","v":0},{"$f":"IF(AND('Petrol (3)'!D31=\"\",'Petrol (4)'!D31=\"\"),\"\",MIN('Petrol (3)'!D31,'Petrol (4)'!D31))","v":0},{"$f":"IF(AND('Petrol (3)'!E31=\"\",'Petrol (4)'!E31=\"\"),\"\",MAX('Petrol (3)'!E31,'Petrol (4)'!E31))","v":0},0,0,0,{"$f":"IF(AND('Petrol (3)'!I31=\"\",'Petrol (4)'!I31=\"\"),\"\",'Petrol (3)'!I31+'Petrol (4)'!I31)","v":0},0,0,null,null,null,3]
["-- Ethanol","% V/V",{"$f":"IF(AND('Petrol (3)'!C32=\"\",'Petrol (4)'!C32=\"\"),\"\",'Petrol (3)'!C32+'Petrol (4)'!C32)","v":0},{"$f":"IF(AND('Petrol (3)'!D32=\"\",'Petrol (4)'!D32=\"\"),\"\",MIN('Petrol (3)'!D32,'Petrol (4)'!D32))","v":0},{"$f":"IF(AND('Petrol (3)'!E32=\"\",'Petrol (4)'!E32=\"\"),\"\",MAX('Petrol (3)'!E32,'Petrol (4)'!E32))","v":0},0,0,0,{"$f":"IF(AND('Petrol (3)'!I32=\"\",'Petrol (4)'!I32=\"\"),\"\",'Petrol (3)'!I32+'Petrol (4)'!I32)","v":0},0,0,null,null,null,10]
["-- Iso-propyl alcohol","% V/V",{"$f":"IF(AND('Petrol (3)'!C33=\"\",'Petrol (4)'!C33=\"\"),\"\",'Petrol (3)'!C33+'Petrol (4)'!C33)","v":0},{"$f":"IF(AND('Petrol (3)'!D33=\"\",'Petrol (4)'!D33=\"\"),\"\",MIN('Petrol (3)'!D33,'Petrol (4)'!D33))","v":0},{"$f":"IF(AND('Petrol (3)'!E33=\"\",'Petrol (4)'!E33=\"\"),\"\",MAX('Petrol (3)'!E33,'Petrol (4)'!E33))","v":0},0,0,0,{"$f":"IF(AND('Petrol (3)'!I33=\"\",'Petrol (4)'!I33=\"\"),\"\",'Petrol (3)'!I33+'Petrol (4)'!I33)","v":0},0,0,null,null,null,12,"EN 1601",1997]
["-- Tert-butyl alcohol","% V/V",{"$f":"IF(AND('Petrol (3)'!C34=\"\",'Petrol (4)'!C34=\"\"),\"\",'Petrol (3)'!C34+'Petrol (4)'!C34)","v":0},{"$f":"IF(AND('Petrol (3)'!D34=\"\",'Petrol (4)'!D34=\"\"),\"\",MIN('Petrol (3)'!D34,'Petrol (4)'!D34))","v":0},{"$f":"IF(AND('Petrol (3)'!E34=\"\",'Petrol (4)'!E34=\"\"),\"\",MAX('Petrol (3)'!E34,'Petrol (4)'!E34))","v":0},0,0,0,{"$f":"IF(AND('Petrol (3)'!I34=\"\",'Petrol (4)'!I34=\"\"),\"\",'Petrol (3)'!I34+'Petrol (4)'!I34)","v":0},0,0,null,null,null,15,"EN 13132",2000]
["-- Iso-butyl alcohol","% V/V",{"$f":"IF(AND('Petrol (3)'!C35=\"\",'Petrol (4)'!C35=\"\"),\"\",'Petrol (3)'!C35+'Petrol (4)'!C35)","v":0},{"$f":"IF(AND('Petrol (3)'!D35=\"\",'Petrol (4)'!D35=\"\"),\"\",MIN('Petrol (3)'!D35,'Petrol (4)'!D35))","v":0},{"$f":"IF(AND('Petrol (3)'!E35=\"\",'Petrol (4)'!E35=\"\"),\"\",MAX('Petrol (3)'!E35,'Petrol (4)'!E35))","v":0},0,0,0,{"$f":"IF(AND('Petrol (3)'!I35=\"\",'Petrol (4)'!I35=\"\"),\"\",'Petrol (3)'!I35+'Petrol (4)'!I35)","v":0},0,0,null,null,null,15,"EN-ISO 22854",2008]
["-- Ethers with ≥5 carbon atoms / molecule","% V/V",{"$f":"IF(AND('Petrol (3)'!C36=\"\",'Petrol (4)'!C36=\"\"),\"\",'Petrol (3)'!C36+'Petrol (4)'!C36)","v":0},{"$f":"IF(AND('Petrol (3)'!D36=\"\",'Petrol (4)'!D36=\"\"),\"\",MIN('Petrol (3)'!D36,'Petrol (4)'!D36))","v":0},{"$f":"IF(AND('Petrol (3)'!E36=\"\",'Petrol (4)'!E36=\"\"),\"\",MAX('Petrol (3)'!E36,'Petrol (4)'!E36))","v":0},0,0,0,{"$f":"IF(AND('Petrol (3)'!I36=\"\",'Petrol (4)'!I36=\"\"),\"\",'Petrol (3)'!I36+'Petrol (4)'!I36)","v":0},0,0,null,null,null,22]
["-- other oxygenates","% V/V",{"$f":"IF(AND('Petrol (3)'!C37=\"\",'Petrol (4)'!C37=\"\"),\"\",'Petrol (3)'!C37+'Petrol (4)'!C37)","v":0},{"$f":"IF(AND('Petrol (3)'!D37=\"\",'Petrol (4)'!D37=\"\"),\"\",MIN('Petrol (3)'!D37,'Petrol (4)'!D37))","v":0},{"$f":"IF(AND('Petrol (3)'!E37=\"\",'Petrol (4)'!E37=\"\"),\"\",MAX('Petrol (3)'!E37,'Petrol (4)'!E37))","v":0},0,0,0,{"$f":"IF(AND('Petrol (3)'!I37=\"\",'Petrol (4)'!I37=\"\"),\"\",'Petrol (3)'!I37+'Petrol (4)'!I37)","v":0},0,0,null,null,null,15]
["Sulphur content","mg/kg",{"$f":"IF(AND('Petrol (3)'!C38=\"\",'Petrol (4)'!C38=\"\"),\"\",'Petrol (3)'!C38+'Petrol (4)'!C38)","v":0},{"$f":"IF(AND('Petrol (3)'!D38=\"\",'Petrol (4)'!D38=\"\"),\"\",MIN('Petrol (3)'!D38,'Petrol (4)'!D38))","v":0},{"$f":"IF(AND('Petrol (3)'!E38=\"\",'Petrol (4)'!E38=\"\"),\"\",MAX('Petrol (3)'!E38,'Petrol (4)'!E38))","v":0},0,0,0,{"$f":"IF(AND('Petrol (3)'!I38=\"\",'Petrol (4)'!I38=\"\"),\"\",'Petrol (3)'!I38+'Petrol (4)'!I38)","v":0},0,0,null,null,null,10,"EN-ISO 14596\nEN 24260\nEN-ISO 20846\nEN-ISO 20884","1998\n1994\n2004\n2004"]
["Lead content","g/l",{"$f":"IF(AND('Petrol (3)'!C39=\"\",'Petrol (4)'!C39=\"\"),\"\",'Petrol (3)'!C39+'Petrol (4)'!C39)","v":0},{"$f":"IF(AND('Petrol (3)'!D39=\"\",'Petrol (4)'!D39=\"\"),\"\",MIN('Petrol (3)'!D39,'Petrol (4)'!D39))","v":0},{"$f":"IF(AND('Petrol (3)'!E39=\"\",'Petrol (4)'!E39=\"\"),\"\",MAX('Petrol (3)'!E39,'Petrol (4)'!E39))","v":0},0,0,0,{"$f":"IF(AND('Petrol (3)'!I39=\"\",'Petrol (4)'!I39=\"\"),\"\",'Petrol (3)'!I39+'Petrol (4)'!I39)","v":0},0,0,null,null,null,5.0000000000000001E-3,"EN 237",1996]
[]
[]
["Sampling frequency"]
[]
["Number of samples in month"]
["January",{"$f":"'Petrol (3)'!B45+'Petrol (4)'!B45","v":0},"July",{"$f":"'Petrol (3)'!D45+'Petrol (4)'!D45","v":0},"(1) The limiting values are \"true values\" and were established according to the procedures for limit setting in EN 228:2008  The results of individual measurements shall be interpreted following the criteria described in EN 228:2008."]
["February",{"$f":"'Petrol (3)'!B46+'Petrol (4)'!B46","v":0},"August",{"$f":"'Petrol (3)'!D46+'Petrol (4)'!D46","v":0}]
["March",{"$f":"'Petrol (3)'!B47+'Petrol (4)'!B47","v":0},"September",{"$f":"'Petrol (3)'!D47+'Petrol (4)'!D47","v":0},"(2) 91 for unleaded regular grade petrol: See 2009/30/EC Annex I, Footnote 3."]
["April",{"$f":"'Petrol (3)'!B48+'Petrol (4)'!B48","v":0},"October",{"$f":"'Petrol (3)'!D48+'Petrol (4)'!D48","v":0},"(3) 81 for unleaded regular grade petrol: See 2009/30/EC Annex I, Footnote 3."]
["May",{"$f":"'Petrol (3)'!B49+'Petrol (4)'!B49","v":0},"November",{"$f":"'Petrol (3)'!D49+'Petrol (4)'!D49","v":0},"(4) 70 kPa for Member States with arctic or severe weather conditions: See 2003/30/EC Annex I, Footnotes 4 & 5."]
["June",{"$f":"'Petrol (3)'!B50+'Petrol (4)'!B50","v":0},"December",{"$f":"'Petrol (3)'!D50+'Petrol (4)'!D50","v":0},"(5) 21 for unleaded regular grade petrol: See 98/70/EC, Annex I, Footnote 6."]
[null,null,"Full YearTotal",{"$f":"SUM(B45:B50,D45:D50)","v":0},"(6) Vapour pressure waiver applies for petrol containing Bioethanol, see 2009/30/EC Annex I, Footnote 5 and Annex III."]
[]
["Other notes (optional):"]
[]
[]
[]
["Test Methods and Analysis",null,null,null,null,null,null,null,"Only if not provided in Summer and Winter sheets"]
[]
["Parameter","Unit","Test specified in 2009/30/EC or EN228:2008",null,null,null,null,null,null,"Notes on exceedences"]
[null,null,"Method","Date","Reproducability, R","Tolerance limits",null,null,null,"Sample location (S,T or R)","Values","Details/action taken"]
[null,null,null,null,null,"Minimum","Maximum","Exceeded?"]
[{"$f":"'Methods&Limits'!A9","v":"Research Octane Number (RON)"},{"$f":"'Methods&Limits'!B9","v":"--"},{"$f":"'Methods&Limits'!E9","v":"EN-ISO 5164"},{"$f":"'Methods&Limits'!F9","v":2014},{"$f":"'Methods&Limits'!G9","v":0.7},{"$f":"'Methods&Limits'!H9","v":94.587000000000003},null,{"$f":"IF(D17=\"\",\"\",IF(D17<F62,\"Yes\",\"\"))","v":"Yes"}]
[{"$f":"'Methods&Limits'!A10","v":"(RON 91 fuel only)"},{"$f":"'Methods&Limits'!B10","v":"--"},{"$f":"'Methods&Limits'!E10","v":"EN-ISO 5164"},{"$f":"'Methods&Limits'!F10","v":2014},{"$f":"'Methods&Limits'!G10","v":0.7},{"$f":"'Methods&Limits'!H10","v":90.587000000000003},null,{"$f":"IF(D17=\"\",\"\",IF(D17<F63,\"Yes\",\"\"))","v":"Yes"}]
[{"$f":"'Methods&Limits'!A11","v":"Motor Octane Number (MON)"},{"$f":"'Methods&Limits'!B11","v":"--"},{"$f":"'Methods&Limits'!E11","v":"EN-ISO 5163"},{"$f":"'Methods&Limits'!F11","v":2014},{"$f":"'Methods&Limits'!G11","v":0.9},{"$f":"'Methods&Limits'!H11","v":84.468999999999994},null,{"$f":"IF(D18=\"\",\"\",IF(D18<F64,\"Yes\",\"\"))","v":"Yes"}]
[{"$f":"'Methods&Limits'!A12","v":"(RON 91 fuel only)"},{"$f":"'Methods&Limits'!B12","v":"--"},{"$f":"'Methods&Limits'!E12","v":"EN-ISO 5163"},{"$f":"'Methods&Limits'!F12","v":2014},{"$f":"'Methods&Limits'!G12","v":0.9},{"$f":"'Methods&Limits'!H12","v":80.468999999999994},null,{"$f":"IF(D18=\"\",\"\",IF(D18<F65,\"Yes\",\"\"))","v":"Yes"}]
[{"$f":"'Methods&Limits'!A13","v":"Vapour Pressure, DVPE"}]
[{"$f":"'Methods&Limits'!A14","v":"--summer period (normal)"},{"$f":"'Methods&Limits'!B14","v":"kPa"},{"$f":"'Methods&Limits'!E14","v":"EN 13016-1"},{"$f":"'Methods&Limits'!F14","v":2018},{"$f":"'Methods&Limits'!G14","v":2.2000000000000002},null,{"$f":"'Methods&Limits'!I14","v":61.298000000000002},{"$f":"IF(E$20=\"\",\"\",IF(E$20>G67,\"Yes\",\"\"))","v":""}]
[{"$f":"'Methods&Limits'!A15","v":"-- Petrol with bioethanol content 0-2"},{"$f":"'Methods&Limits'!B15","v":"kPa"},{"$f":"'Methods&Limits'!E15","v":"EN 1601"},{"$f":"'Methods&Limits'!F15","v":2017},{"$f":"'Methods&Limits'!G15","v":2.2999999999999998},null,{"$f":"'Methods&Limits'!I15","v":67.307000000000002},{"$f":"IF(E$20=\"\",\"\",IF(E$20>G68,\"Yes\",\"\"))","v":""}]
[{"$f":"'Methods&Limits'!A16","v":"-- Petrol with bioethanol content 2-4"},{"$f":"'Methods&Limits'!B16","v":"kPa"},{"$f":"'Methods&Limits'!E16","v":"EN 1601"},{"$f":"'Methods&Limits'!F16","v":2017},{"$f":"'Methods&Limits'!G16","v":2.2999999999999998},null,{"$f":"'Methods&Limits'!I16","v":69.156999999999996},""]
[{"$f":"'Methods&Limits'!A17","v":"-- Petrol with bioethanol content 4-6"},{"$f":"'Methods&Limits'!B17","v":"kPa"},{"$f":"'Methods&Limits'!E17","v":"EN 1601"},{"$f":"'Methods&Limits'!F17","v":2017},{"$f":"'Methods&Limits'!G17","v":2.2999999999999998},null,{"$f":"'Methods&Limits'!I17","v":69.356999999999999},""]
[{"$f":"'Methods&Limits'!A18","v":"-- Petrol with bioethanol content 6-8"},{"$f":"'Methods&Limits'!B18","v":"kPa"},{"$f":"'Methods&Limits'!E18","v":"EN 1601"},{"$f":"'Methods&Limits'!F18","v":2017},{"$f":"'Methods&Limits'!G18","v":2.2999999999999998},null,{"$f":"'Methods&Limits'!I18","v":69.236999999999995},""]
[{"$f":"'Methods&Limits'!A19","v":"-- Petrol with bioethanol content 8-10"},{"$f":"'Methods&Limits'!B19","v":"kPa"},{"$f":"'Methods&Limits'!E19","v":"EN 1601"},{"$f":"'Methods&Limits'!F19","v":2017},{"$f":"'Methods&Limits'!G19","v":2.2999999999999998},null,{"$f":"'Methods&Limits'!I19","v":69.117000000000004},""]
[{"$f":"'Methods&Limits'!A20","v":"--summer period (arctic or severe weather conditions)"},{"$f":"'Methods&Limits'!B20","v":"kPa"},{"$f":"'Methods&Limits'!E20","v":"EN 13016-1"},{"$f":"'Methods&Limits'!F20","v":2018},{"$f":"'Methods&Limits'!G20","v":2.2999999999999998},null,{"$f":"'Methods&Limits'!I20","v":71.356999999999999},""]
[{"$f":"'Methods&Limits'!A21","v":"Distillation *"}]
[{"$f":"'Methods&Limits'!A22","v":"--evaporated at 100 oC"},{"$f":"'Methods&Limits'!B22","v":"% V/V"},{"$f":"'Methods&Limits'!E22","v":"EN-ISO 3405"},{"$f":"'Methods&Limits'!F22","v":2020},{"$f":"'Methods&Limits'!G22","v":4},{"$f":"'Methods&Limits'!H22","v":43.64},null,{"$f":"IF(D22=\"\",\"\",IF(D22<F75,\"Yes\",\"\"))","v":"Yes"}]
[{"$f":"'Methods&Limits'!A23","v":"-- evaporated at 150 oC "},{"$f":"'Methods&Limits'!B23","v":"% V/V"},{"$f":"'Methods&Limits'!E23","v":"EN-ISO 3405"},{"$f":"'Methods&Limits'!F23","v":2020},{"$f":"'Methods&Limits'!G23","v":4},{"$f":"'Methods&Limits'!H23","v":72.64},null,{"$f":"IF(D23=\"\",\"\",IF(D23<F76,\"Yes\",\"\"))","v":"Yes"}]
[{"$f":"'Methods&Limits'!A24","v":"Hydrocarbon analysis"},null,null,null,null,null,null,{"$f":"IF(D24<F77,\"Yes\",\"\")","v":""}]
[{"$f":"'Methods&Limits'!A25","v":"-- Olefins"},{"$f":"'Methods&Limits'!B25","v":"% V/V"},{"$f":"'Methods&Limits'!E25","v":"EN 15553"},{"$f":"'Methods&Limits'!F25","v":2021},{"$f":"'Methods&Limits'!G25","v":6.4},null,{"$f":"'Methods&Limits'!I25","v":21.776},{"$f":"IF(E$25=\"\",\"\",IF(E$25>G78,\"Yes\",\"\"))","v":""}]
[null,null,{"$f":"'Methods&Limits'!E26","v":"EN-ISO 22854"},{"$f":"'Methods&Limits'!F26","v":2021},{"$f":"'Methods&Limits'!G26","v":2.6},null,{"$f":"'Methods&Limits'!I26","v":19.533999999999999},{"$f":"IF(E$25=\"\",\"\",IF(E$25>G79,\"Yes\",\"\"))","v":""}]
[{"$f":"'Methods&Limits'!A27","v":"*without oxygenates"},null,{"$f":"'Methods&Limits'!E27","v":"EN 15553"},{"$f":"'Methods&Limits'!F27","v":2021},{"$f":"'Methods&Limits'!G27","v":"-"},null,{"$f":"'Methods&Limits'!I27","v":"-"},{"$f":"IF(E$25=\"\",\"\",IF(E$25>G80,\"Yes\",\"\"))","v":""}]
[null,null,{"$f":"'Methods&Limits'!E28","v":"EN-ISO 22854"},{"$f":"'Methods&Limits'!F28","v":2021},{"$f":"'Methods&Limits'!G28","v":"-"},null,{"$f":"'Methods&Limits'!I28","v":"-"},{"$f":"IF(E$25=\"\",\"\",IF(E$25>G81,\"Yes\",\"\"))","v":""}]
[{"$f":"'Methods&Limits'!A29","v":"-- Olefins (RON 91 fuel only)***"},{"$f":"'Methods&Limits'!B29","v":"% V/V"},{"$f":"'Methods&Limits'!E29","v":"ASTM D1319"},{"$f":"'Methods&Limits'!F29","v":2020},{"$f":"'Methods&Limits'!G29","v":5.0999999999999996},null,{"$f":"'Methods&Limits'!I29","v":24.009},{"$f":"IF(E$25=\"\",\"\",IF(E$25>G82,\"Yes\",\"\"))","v":""}]
[{"$f":"'Methods&Limits'!A30","v":"-- Aromatics (from 2005)"},null,{"$f":"'Methods&Limits'!E30","v":"EN-ISO 22854"},{"$f":"'Methods&Limits'!F30","v":2021},{"$f":"'Methods&Limits'!G30","v":1.7},null,{"$f":"'Methods&Limits'!I30","v":36.003},{"$f":"IF(E$26=\"\",\"\",IF(E$26>G83,\"Yes\",\"\"))","v":""}]
[{"$f":"'Methods&Limits'!A31","v":"-- Benzene"},{"$f":"'Methods&Limits'!B31","v":"% V/V"},{"$f":"'Methods&Limits'!E31","v":"EN 12177"},{"$f":"'Methods&Limits'!F31","v":2022},{"$f":"'Methods&Limits'!G31","v":0.1},null,{"$f":"'Methods&Limits'!I31","v":1.0589999999999999},{"$f":"IF(E$27=\"\",\"\",IF(E$27>G84,\"Yes\",\"\"))","v":""}]
[null,null,{"$f":"'Methods&Limits'!E32","v":"EN 238"},{"$f":"'Methods&Limits'!F32","v":1996},{"$f":"'Methods&Limits'!G32","v":0.17},null,{"$f":"'Methods&Limits'!I32","v":1.1003000000000001},{"$f":"IF(E$27=\"\",\"\",IF(E$27>G85,\"Yes\",\"\"))","v":""}]
[null,null,{"$f":"'Methods&Limits'!E33","v":"EN-ISO 22854"},{"$f":"'Methods&Limits'!F33","v":2021},{"$f":"'Methods&Limits'!G33","v":0.05},null,{"$f":"'Methods&Limits'!I33","v":1.0295000000000001},{"$f":"IF(E$27=\"\",\"\",IF(E$27>G86,\"Yes\",\"\"))","v":""}]
[{"$f":"'Methods&Limits'!A34","v":"Oxygen content"},{"$f":"'Methods&Limits'!B34","v":"% (m/m)"},{"$f":"'Methods&Limits'!E34","v":"EN 1601"},{"$f":"'Methods&Limits'!F34","v":2017},{"$f":"'Methods&Limits'!G34","v":0.41},null,{"$f":"'Methods&Limits'!I34","v":3.9419},{"$f":"IF(E$27=\"\",\"\",IF(E$27>G87,\"Yes\",\"\"))","v":""}]
[null,null,{"$f":"'Methods&Limits'!E35","v":"EN 1601"},{"$f":"'Methods&Limits'!F35","v":2017},{"$f":"'Methods&Limits'!G35","v":0.41},null,{"$f":"'Methods&Limits'!I35","v":2.9419},{"$f":"IF(E$27=\"\",\"\",IF(E$27>G88,\"Yes\",\"\"))","v":""}]
[{"$f":"'Methods&Limits'!A36","v":"Oxygenates"}]
[{"$f":"'Methods&Limits'!A37","v":"-- Methanol"},{"$f":"'Methods&Limits'!B37","v":"% V/V"},{"$f":"'Methods&Limits'!E37","v":"EN 1601"},{"$f":"'Methods&Limits'!F37","v":2017},{"$f":"'Methods&Limits'!G37","v":0.3},null,{"$f":"'Methods&Limits'!I37","v":3.177},{"$f":"IF(E31=\"\",\"\",IF(E31>G90,\"Yes\",\"\"))","v":""}]
[{"$f":"'Methods&Limits'!A38","v":"-- Ethanol"},{"$f":"'Methods&Limits'!B38","v":"% V/V"},{"$f":"'Methods&Limits'!E38","v":"EN 1601"},{"$f":"'Methods&Limits'!F38","v":2017},{"$f":"'Methods&Limits'!G38","v":0.8},null,{"$f":"'Methods&Limits'!I38","v":10.472},""]
[{"$f":"'Methods&Limits'!A39","v":"-- Iso-propyl alcohol"},{"$f":"'Methods&Limits'!B39","v":"% V/V"},{"$f":"'Methods&Limits'!E39","v":"EN 1601"},{"$f":"'Methods&Limits'!F39","v":2017},{"$f":"'Methods&Limits'!G39","v":0.9},null,{"$f":"'Methods&Limits'!I39","v":12.531000000000001},""]
[{"$f":"'Methods&Limits'!A40","v":"-- Tert-butyl alcohol"},{"$f":"'Methods&Limits'!B40","v":"% V/V"},{"$f":"'Methods&Limits'!E40","v":"EN 1601"},{"$f":"'Methods&Limits'!F40","v":2017},{"$f":"'Methods&Limits'!G40","v":1},null,{"$f":"'Methods&Limits'!I40","v":15.59},""]
[{"$f":"'Methods&Limits'!A41","v":"-- Iso-butyl alcohol"},{"$f":"'Methods&Limits'!B41","v":"% V/V"},{"$f":"'Methods&Limits'!E41","v":"EN 1601"},{"$f":"'Methods&Limits'!F41","v":2017},{"$f":"'Methods&Limits'!G41","v":1},null,{"$f":"'Methods&Limits'!I41","v":15.59},""]
[{"$f":"'Methods&Limits'!A42","v":"-- Ethers with 5 or more carbon atoms per molecule"},{"$f":"'Methods&Limits'!B42","v":"% V/V"},{"$f":"'Methods&Limits'!E42","v":"EN 1601"},{"$f":"'Methods&Limits'!F42","v":2017},{"$f":"'Methods&Limits'!G42","v":1},null,{"$f":"'Methods&Limits'!I42","v":22.59},""]
[{"$f":"'Methods&Limits'!A43","v":"-- other oxygenates"},{"$f":"'Methods&Limits'!B43","v":"% V/V"},{"$f":"'Methods&Limits'!E43","v":"EN 1601"},{"$f":"'Methods&Limits'!F43","v":2017},{"$f":"'Methods&Limits'!G43","v":1},null,{"$f":"'Methods&Limits'!I43","v":15.59},""]
[{"$f":"'Methods&Limits'!A44","v":"Oxygen content"},{"$f":"'Methods&Limits'!B44","v":"% (m/m)"},{"$f":"'Methods&Limits'!E44","v":"EN 13132"},{"$f":"'Methods&Limits'!F44","v":2002},{"$f":"'Methods&Limits'!G44","v":0.3},null,{"$f":"'Methods&Limits'!I44","v":3.8770000000000002},{"$f":"IF(E28=\"\",\"\",IF(E28>G97,\"Yes\",\"\"))","v":""}]
[null,null,{"$f":"'Methods&Limits'!E45","v":"EN 13132"},{"$f":"'Methods&Limits'!F45","v":2002},{"$f":"'Methods&Limits'!G45","v":0.3},null,{"$f":"'Methods&Limits'!I45","v":2.8770000000000002},{"$f":"IF(E29=\"\",\"\",IF(E29>G98,\"Yes\",\"\"))","v":""}]
[{"$f":"'Methods&Limits'!A46","v":"Oxygenates"}]
[{"$f":"'Methods&Limits'!A47","v":"-- Methanol"},{"$f":"'Methods&Limits'!B47","v":"% V/V"},{"$f":"'Methods&Limits'!E47","v":"EN 13132"},{"$f":"'Methods&Limits'!F47","v":2002},{"$f":"'Methods&Limits'!G47","v":0.3},null,{"$f":"'Methods&Limits'!I47","v":3.177},{"$f":"IF(E31=\"\",\"\",IF(E31>G100,\"Yes\",\"\"))","v":""}]
[{"$f":"'Methods&Limits'!A48","v":"-- Ethanol"},{"$f":"'Methods&Limits'!B48","v":"% V/V"},{"$f":"'Methods&Limits'!E48","v":"EN 13132"},{"$f":"'Methods&Limits'!F48","v":2002},{"$f":"'Methods&Limits'!G48","v":0.8},null,{"$f":"'Methods&Limits'!I48","v":10.472},""]
[{"$f":"'Methods&Limits'!A49","v":"-- Iso-propyl alcohol"},{"$f":"'Methods&Limits'!B49","v":"% V/V"},{"$f":"'Methods&Limits'!E49","v":"EN 13132"},{"$f":"'Methods&Limits'!F49","v":2002},{"$f":"'Methods&Limits'!G49","v":0.8},null,{"$f":"'Methods&Limits'!I49","v":12.472},""]
[{"$f":"'Methods&Limits'!A50","v":"-- Tert-butyl alcohol"},{"$f":"'Methods&Limits'!B50","v":"% V/V"},{"$f":"'Methods&Limits'!E50","v":"EN 13132"},{"$f":"'Methods&Limits'!F50","v":2002},{"$f":"'Methods&Limits'!G50","v":1},null,{"$f":"'Methods&Limits'!I50","v":15.59},""]
[{"$f":"'Methods&Limits'!A51","v":"-- Iso-butyl alcohol"},{"$f":"'Methods&Limits'!B51","v":"% V/V"},{"$f":"'Methods&Limits'!E51","v":"EN 13132"},{"$f":"'Methods&Limits'!F51","v":2002},{"$f":"'Methods&Limits'!G51","v":1},null,{"$f":"'Methods&Limits'!I51","v":15.59},""]
[{"$f":"'Methods&Limits'!A52","v":"-- Ethers with 5 or more carbon atoms per molecule"},{"$f":"'Methods&Limits'!B52","v":"% V/V"},{"$f":"'Methods&Limits'!E52","v":"EN 13132"},{"$f":"'Methods&Limits'!F52","v":2002},{"$f":"'Methods&Limits'!G52","v":1},null,{"$f":"'Methods&Limits'!I52","v":22.59},""]
[{"$f":"'Methods&Limits'!A53","v":"-- other oxygenates"},{"$f":"'Methods&Limits'!B53","v":"% V/V"},{"$f":"'Methods&Limits'!E53","v":"EN 13132"},{"$f":"'Methods&Limits'!F53","v":2002},{"$f":"'Methods&Limits'!G53","v":1},null,{"$f":"'Methods&Limits'!I53","v":15.59},""]
[{"$f":"'Methods&Limits'!A54","v":"Oxygen content"},{"$f":"'Methods&Limits'!B54","v":"% (m/m)"},{"$f":"'Methods&Limits'!E54","v":"EN-ISO 22854"},{"$f":"'Methods&Limits'!F54","v":2021},{"$f":"'Methods&Limits'!G54","v":0.4},null,{"$f":"'Methods&Limits'!I54","v":3.9359999999999999},{"$f":"IF(E28=\"\",\"\",IF(E28>G107,\"Yes\",\"\"))","v":""}]
[null,null,{"$f":"'Methods&Limits'!E55","v":"EN-ISO 22854"},{"$f":"'Methods&Limits'!F55","v":2021},{"$f":"'Methods&Limits'!G55","v":0.4},null,{"$f":"'Methods&Limits'!I55","v":2.9359999999999999},{"$f":"IF(E29=\"\",\"\",IF(E29>G108,\"Yes\",\"\"))","v":""}]
[{"$f":"'Methods&Limits'!A56","v":"Oxyginates"}]
[{"$f":"'Methods&Limits'!A57","v":"-- Methanol"},{"$f":"'Methods&Limits'!B57","v":"% V/V"},{"$f":"'Methods&Limits'!E57","v":"EN-ISO 22854"},{"$f":"'Methods&Limits'!F57","v":2021},{"$f":"'Methods&Limits'!G57","v":0.4},null,{"$f":"'Methods&Limits'!I57","v":3.2359999999999998},{"$f":"IF(E31=\"\",\"\",IF(E31>G110,\"Yes\",\"\"))","v":""}]
[{"$f":"'Methods&Limits'!A58","v":"-- Ethanol"},{"$f":"'Methods&Limits'!B58","v":"% V/V"},{"$f":"'Methods&Limits'!E58","v":"EN-ISO 22854"},{"$f":"'Methods&Limits'!F58","v":2021},{"$f":"'Methods&Limits'!G58","v":0.6},null,{"$f":"'Methods&Limits'!I58","v":10.353999999999999},""]
[{"$f":"'Methods&Limits'!A59","v":"-- Iso-propyl alcohol"},{"$f":"'Methods&Limits'!B59","v":"% V/V"},{"$f":"'Methods&Limits'!E59","v":"EN-ISO 22854"},{"$f":"'Methods&Limits'!F59","v":2021},{"$f":"'Methods&Limits'!G59","v":0.7},null,{"$f":"'Methods&Limits'!I59","v":12.413},""]
[{"$f":"'Methods&Limits'!A60","v":"-- Tert-butyl alcohol"},{"$f":"'Methods&Limits'!B60","v":"% V/V"},{"$f":"'Methods&Limits'!E60","v":"EN-ISO 22854"},{"$f":"'Methods&Limits'!F60","v":2021},{"$f":"'Methods&Limits'!G60","v":0.7},null,{"$f":"'Methods&Limits'!I60","v":15.413},""]
[{"$f":"'Methods&Limits'!A61","v":"-- Iso-butyl alcohol"},{"$f":"'Methods&Limits'!B61","v":"% V/V"},{"$f":"'Methods&Limits'!E61","v":"EN-ISO 22854"},{"$f":"'Methods&Limits'!F61","v":2021},{"$f":"'Methods&Limits'!G61","v":0.7},null,{"$f":"'Methods&Limits'!I61","v":15.413},""]
[{"$f":"'Methods&Limits'!A62","v":"-- Ethers with 5 or more carbon atoms per molecule"},{"$f":"'Methods&Limits'!B62","v":"% V/V"},{"$f":"'Methods&Limits'!E62","v":"EN-ISO 22854"},{"$f":"'Methods&Limits'!F62","v":2021},{"$f":"'Methods&Limits'!G62","v":0.9},null,{"$f":"'Methods&Limits'!I62","v":22.530999999999999},""]
[{"$f":"'Methods&Limits'!A63","v":"-- other oxygenates"},{"$f":"'Methods&Limits'!B63","v":"% V/V"},{"$f":"'Methods&Limits'!E63","v":"EN-ISO 22854"},{"$f":"'Methods&Limits'!F63","v":2021},{"$f":"'Methods&Limits'!G63","v":0.7},null,{"$f":"'Methods&Limits'!I63","v":15.413},""]
[{"$f":"'Methods&Limits'!A64:A64","v":"Sulphur content (sulphur free, from 2005)**"},{"$f":"'Methods&Limits'!B64","v":"mg/kg"},{"$f":"'Methods&Limits'!E64","v":"EN-ISO 14596"},{"$f":"'Methods&Limits'!F64","v":2018},{"$f":"'Methods&Limits'!G64","v":5},null,{"$f":"'Methods&Limits'!I64","v":12.95},{"$f":"IF(E$38=\"\",\"\",IF(E$38>G117,\"Yes\",\"\"))","v":""}]
[null,null,{"$f":"'Methods&Limits'!E65","v":"EN 24260"},{"$f":"'Methods&Limits'!F65","v":1994},{"$f":"'Methods&Limits'!G65","v":1},null,{"$f":"'Methods&Limits'!I65","v":10.59},{"$f":"IF(E$38=\"\",\"\",IF(E$38>G118,\"Yes\",\"\"))","v":""}]
[null,null,{"$f":"'Methods&Limits'!E66","v":"EN-ISO 20846"},{"$f":"'Methods&Limits'!F66","v":2019},{"$f":"'Methods&Limits'!G66","v":2.7},null,{"$f":"'Methods&Limits'!I66","v":11.593},{"$f":"IF(E$38=\"\",\"\",IF(E$38>G119,\"Yes\",\"\"))","v":""}]
[null,null,{"$f":"'Methods&Limits'!E67","v":"EN-ISO 20884"},{"$f":"'Methods&Limits'!F67","v":2019},{"$f":"'Methods&Limits'!G67","v":3.1},null,{"$f":"'Methods&Limits'!I67","v":11.829000000000001},{"$f":"IF(E$38=\"\",\"\",IF(E$38>G120,\"Yes\",\"\"))","v":""}]
[{"$f":"'Methods&Limits'!A68:A68","v":"Lead content"},{"$f":"'Methods&Limits'!B68","v":"g/l"},{"$f":"'Methods&Limits'!E68","v":"EN 237"},{"$f":"'Methods&Limits'!F68","v":2004},{"$f":"'Methods&Limits'!G68","v":6.1999999999999998E-3},null,{"$f":"'Methods&Limits'!I68","v":8.657999999999999E-3},{"$f":"IF(E39=\"\",\"\",IF(E39>G121,\"Yes\",\"\"))","v":""}]

{"sheet":"Petrol (5)","index":19,"n_rows":121,"n_cols":18,"rows_kept":121,"cut":false,"hidden":false,"merged":[[2,1,2,4],[2,6,9,16],[3,1,3,4],[4,1,4,4],[5,1,5,4],[6,1,6,4],[7,2,7,4],[13,2,14,10],[13,11,13,14],[13,15,13,16],[14,11,14,12],[14,13,14,14],[14,15,14,16],[58,2,58,8],[58,9,58,12],[20,15,22,15],[27,15,28,15],[27,16,28,16],[43,0,43,3],[44,4,45,11],[46,4,46,11],[47,4,47,11],[48,4,48,11],[49,4,49,11],[50,4,50,11],[53,0,53,11],[71,11,71,12],[59,5,59,6],[59,9,60,9],[61,11,61,12],[62,11,62,12],[63,11,63,12],[64,11,64,12],[66,11,66,12],[67,11,67,12],[68,11,68,12],[69,11,69,12],[70,11,70,12],[59,11,59,12],[85,11,85,12],[72,11,72,12],[74,11,74,12],[75,11,75,12],[77,11,77,12],[78,11,78,12],[79,11,79,12],[80,11,80,12],[81,11,81,12],[82,11,82,12],[83,11,83,12],[84,11,84,12],[99,11,99,12],[86,11,86,12],[87,11,87,12],[89,11,89,12],[90,11,90,12],[91,11,91,12],[92,11,92,12],[93,11,93,12],[94,11,94,12],[95,11,95,12],[96,11,96,12],[97,11,97,12],[112,11,112,12],[100,11,100,12],[101,11,101,12],[102,11,102,12],[103,11,103,12],[104,11,104,12],[105,11,105,12],[106,11,106,12],[107,11,107,12],[109,11,109,12],[110,11,110,12],[111,11,111,12],[119,11,119,12],[120,11,120,12],[121,11,121,12],[122,11,122,12],[113,11,113,12],[114,11,114,12],[115,11,115,12],[116,11,116,12],[117,11,117,12],[118,11,118,12]]}
["Market Fuels used in Vehicles with Spark Ignition Engines (Petrol)",null,null,null,null,null,null,null,null,null,null,null,null,null,null,null,null,"<-- GO BACK"]
[]
["Country",{"$f":"IF(LEN('Contacts&Annual Summary'!C9) > 1,'Contacts&Annual Summary'!C9,\"\")","v":""},null,null,null,null,"Notes on completing the tables\nThe table structure has been locked to prevent modification - data can be copied and pasted, in bulk into the Reporting Results blue table cells.  Where a white row exists between rows, it will not be possible to paste over white rows and sections should be pasted separately.\n\nColumn H in the Test Methods and Analysis table is set to automatically check whether the values entered in the Reporting Results table exceed maximum or minimum Tolerance Limits.  If any exceedance is detected, please provide details in the columns to the right including the number of samples, location samples were taken from, Values and Details of any action taken to address non-compliant samples.  Compliance information is verified manually and this automated compliance check is not solely relied upon during data analysis.\n\nPlease do not unlock this template - modified templates cannot be processed and may delay reporting."]
["Reporting Year",{"$f":"'Contacts&Annual Summary'!C8","v":2023}]
["Period (Summer or Winter)","Summer"]
["Parent fuel grade","Petrol"]
["National fuel grade"]
["Summer Period (N or A)*",0,{"$f":"IF( B8=\"A\",\"1st June to 31st August (arctic)\",\"1st May to 30th September (normal)\")","v":"1st May to 30th September (normal)"}]
["The maximum bioethanol content (% v/v)",0,"Please include the bioethanol content as a numerical figure in % V/V"]
["* N = 1st May to 30th September (normal) ; A = 1st June to 31st August (arctic)."]
[]
["Reporting results"]
[]
["Parameter","Unit","Analytical and statistical results \n(Please see an explanation and examples for new columns/ information required in Cells I15 to K37 on the Introduction & Instructions tab).",null,null,null,null,null,null,null,null,"Limiting Value (1)",null,null,null,"Test method"]
[null,null,null,null,null,null,null,null,null,null,null,"National Specification, if any",null,"According to Directive 2009/30/EC",null,"(more recent versions may also be used)"]
[null,null,"No Samples","Minimum","Maximum","Median","Mean","Standard Deviation","No Samples outside 95% tolerance limit","25% of Sample Value","75% of Sample Value","Minimum","Maximum","Minimum","Maximum","Method","Date"]
["Research Octane Number","--",0,0,0,0,0,0,0,0,0,null,null,"95 (2)",null,"EN-ISO 5164",2005]
["Motor Octane Number","--",0,0,0,0,0,0,0,0,0,null,null,"85 (3)",null,"EN-ISO 5163",2005]
["Vapour Pressure, DVPE (6)","kPa",null,null,null,null,null,null,null,null,null,null,null,null,"(4)"]
["-- required for summer period only",null,0,0,0,0,0,0,0,0,0,null,null,null,{"$f":"IF(E8=\"A\",70,60)","v":60},"EN 13106-1",2007]
["Distillation",null,null,null,null,null,null,null,null,null,null,null,null,null,null,"EN-ISO 3405"]
["-- evaporated at 100 oC","% V/V",0,0,0,0,0,0,0,0,0,null,null,46,null,null,2000]
["-- evaporated at 150 oC ","% V/V",0,0,0,0,0,0,0,0,0,null,null,75]
["Hydrocarbon analysis"]
["-- Olefins","% V/V",0,0,0,0,0,0,0,0,0,null,null,null,"18.0 (5)","ASTM D 1319\nEN 15553\nEN-ISO 22854","1995\n2007\n2008"]
["-- Aromatics","% V/V",0,0,0,0,0,0,0,0,0,null,null,null,35,"EN-ISO 22854","1995\n2008"]
["-- Benzene","% V/V",0,0,0,0,0,0,0,0,0,null,null,null,1,"EN 238\nEN 12177\nEN-ISO 22854","1996\n1998\n2008"]
[{"$f":"IF(C29>0,\"Do not complete\",\"Oxygen content\")","v":"Oxygen content"},"% (m/m)",0,0,0,0,0,0,0,0,0,null,null,null,3.7,"EN 1601\nEN 13132\nEN-ISO 22854","1997\n2000\n2008"]
[{"$f":"IF(C28>0,\"Do not complete\",\"Oxygen content*\n*petrol with 5% (v/v) or less ethanol content\")","v":"Oxygen content*\n*petrol with 5% (v/v) or less ethanol content"},"% (m/m)",0,0,0,0,0,0,0,0,0,null,null,null,2.7]
["Oxygenates"]
["-- Methanol","% V/V",0,0,0,0,0,0,0,0,0,null,null,null,3]
["-- Ethanol","% V/V",0,0,0,0,0,0,0,0,0,null,null,null,10]
["-- Iso-propyl alcohol","% V/V",0,0,0,0,0,0,0,0,0,null,null,null,12,"EN 1601",1997]
["-- Tert-butyl alcohol","% V/V",0,0,0,0,0,0,0,0,0,null,null,null,15,"EN 13132",2000]
["-- Iso-butyl alcohol","% V/V",0,0,0,0,0,0,0,0,0,null,null,null,15,"EN-ISO 22854",2008]
["-- Ethers with ≥5 carbon atoms / molecule","% V/V",0,0,0,0,0,0,0,0,0,null,null,null,22]
["-- other oxygenates","% V/V",0,0,0,0,0,0,0,0,0,null,null,null,15]
["Sulphur content","mg/kg",0,0,0,0,0,0,0,0,0,null,null,null,10,"EN-ISO 14596\nEN 24260\nEN-ISO 20846\nEN-ISO 20884","1998\n1994\n2004\n2004"]
["Lead content","g/l",0,0,0,0,0,0,0,0,0,null,null,null,5.0000000000000001E-3,"EN 237",1996]
[]
[]
["Sampling frequency"]
[]
["Number of samples in month"]
["January",0,"July",0,"(1) The limiting values are \"true values\" and were established according to the procedures for limit setting in EN 228:2008  The results of individual measurements shall be interpreted following the criteria described in EN 228:2008."]
["February",0,"August",0]
["March",0,"September",0,"(2) 91 for unleaded regular grade petrol: See 2009/30/EC Annex I, Footnote 3."]
["April",0,"October",0,"(3) 81 for unleaded regular grade petrol: See 2009/30/EC Annex I, Footnote 3."]
["May",0,"November",0,"(4) 70 kPa for Member States with arctic or severe weather conditions: See 2003/30/EC Annex I, Footnotes 4 & 5."]
["June",0,"December",0,"(5) 21 for unleaded regular grade petrol: See 98/70/EC, Annex I, Footnote 6."]
[null,null,"Summer Months Total",{"$f":"SUM(B45:B50,D45:D50)","v":0},"(6) Vapour pressure waiver applies for petrol containing Bioethanol, see 2009/30/EC Annex I, Footnote 5 and Annex III."]
[]
["Other notes (optional):"]
[]
[]
[]
["Test Methods and Analysis"]
[]
["Parameter","Unit","Test specified in 2009/30/EC or EN228:2008",null,null,null,null,null,null,"Notes on exceedences"]
[null,null,"Method","Date","Reproducability, R","Tolerance limits",null,null,null,"Sample location (S,T or R)","Values","Details/action taken"]
[null,null,null,null,null,"Minimum","Maximum","Exceeded?"]
[{"$f":"'Methods&Limits'!A9","v":"Research Octane Number (RON)"},{"$f":"'Methods&Limits'!B9","v":"--"},{"$f":"'Methods&Limits'!E9","v":"EN-ISO 5164"},{"$f":"'Methods&Limits'!F9","v":2014},{"$f":"'Methods&Limits'!G9","v":0.7},{"$f":"'Methods&Limits'!H9","v":94.587000000000003},null,{"$f":"IF(D17=\"\",\"\",IF(D17<F62,\"Yes\",\"\"))","v":"Yes"}]
[{"$f":"'Methods&Limits'!A10","v":"(RON 91 fuel only)"},{"$f":"'Methods&Limits'!B10","v":"--"},{"$f":"'Methods&Limits'!E10","v":"EN-ISO 5164"},{"$f":"'Methods&Limits'!F10","v":2014},{"$f":"'Methods&Limits'!G10","v":0.7},{"$f":"'Methods&Limits'!H10","v":90.587000000000003},null,{"$f":"IF(D17=\"\",\"\",IF(D17<F63,\"Yes\",\"\"))","v":"Yes"}]
[{"$f":"'Methods&Limits'!A11","v":"Motor Octane Number (MON)"},{"$f":"'Methods&Limits'!B11","v":"--"},{"$f":"'Methods&Limits'!E11","v":"EN-ISO 5163"},{"$f":"'Methods&Limits'!F11","v":2014},{"$f":"'Methods&Limits'!G11","v":0.9},{"$f":"'Methods&Limits'!H11","v":84.468999999999994},null,{"$f":"IF(D18=\"\",\"\",IF(D18<F64,\"Yes\",\"\"))","v":"Yes"}]
[{"$f":"'Methods&Limits'!A12","v":"(RON 91 fuel only)"},{"$f":"'Methods&Limits'!B12","v":"--"},{"$f":"'Methods&Limits'!E12","v":"EN-ISO 5163"},{"$f":"'Methods&Limits'!F12","v":2014},{"$f":"'Methods&Limits'!G12","v":0.9},{"$f":"'Methods&Limits'!H12","v":80.468999999999994},null,{"$f":"IF(D18=\"\",\"\",IF(D18<F65,\"Yes\",\"\"))","v":"Yes"}]
[{"$f":"'Methods&Limits'!A13","v":"Vapour Pressure, DVPE"}]
[{"$f":"'Methods&Limits'!A14","v":"--summer period (normal)"},{"$f":"'Methods&Limits'!B14","v":"kPa"},{"$f":"'Methods&Limits'!E14","v":"EN 13016-1"},{"$f":"'Methods&Limits'!F14","v":2018},{"$f":"'Methods&Limits'!G14","v":2.2000000000000002},null,{"$f":"'Methods&Limits'!I14","v":61.298000000000002},{"$f":"IF(E20>G67,\"Yes\",\"\")","v":""}]
[{"$f":"'Methods&Limits'!A15","v":"-- Petrol with bioethanol content 0-2"},{"$f":"'Methods&Limits'!B15","v":"kPa"},{"$f":"'Methods&Limits'!E15","v":"EN 1601"},{"$f":"'Methods&Limits'!F15","v":2017},{"$f":"'Methods&Limits'!G15","v":2.2999999999999998},null,{"$f":"'Methods&Limits'!I15","v":67.307000000000002},{"$f":"IF(E20>G68,\"Yes\",\"\")","v":""}]
[{"$f":"'Methods&Limits'!A16","v":"-- Petrol with bioethanol content 2-4"},{"$f":"'Methods&Limits'!B16","v":"kPa"},{"$f":"'Methods&Limits'!E16","v":"EN 1601"},{"$f":"'Methods&Limits'!F16","v":2017},{"$f":"'Methods&Limits'!G16","v":2.2999999999999998},null,{"$f":"'Methods&Limits'!I16","v":69.156999999999996},{"$f":"IF(E20>G69,\"Yes\",\"\")","v":""}]
[{"$f":"'Methods&Limits'!A17","v":"-- Petrol with bioethanol content 4-6"},{"$f":"'Methods&Limits'!B17","v":"kPa"},{"$f":"'Methods&Limits'!E17","v":"EN 1601"},{"$f":"'Methods&Limits'!F17","v":2017},{"$f":"'Methods&Limits'!G17","v":2.2999999999999998},null,{"$f":"'Methods&Limits'!I17","v":69.356999999999999},{"$f":"IF(E20>G70,\"Yes\",\"\")","v":""}]
[{"$f":"'Methods&Limits'!A18","v":"-- Petrol with bioethanol content 6-8"},{"$f":"'Methods&Limits'!B18","v":"kPa"},{"$f":"'Methods&Limits'!E18","v":"EN 1601"},{"$f":"'Methods&Limits'!F18","v":2017},{"$f":"'Methods&Limits'!G18","v":2.2999999999999998},null,{"$f":"'Methods&Limits'!I18","v":69.236999999999995},{"$f":"IF(E20>G71,\"Yes\",\"\")","v":""}]
[{"$f":"'Methods&Limits'!A19","v":"-- Petrol with bioethanol content 8-10"},{"$f":"'Methods&Limits'!B19","v":"kPa"},{"$f":"'Methods&Limits'!E19","v":"EN 1601"},{"$f":"'Methods&Limits'!F19","v":2017},{"$f":"'Methods&Limits'!G19","v":2.2999999999999998},null,{"$f":"'Methods&Limits'!I19","v":69.117000000000004},{"$f":"IF(E20>G72,\"Yes\",\"\")","v":""}]
[{"$f":"'Methods&Limits'!A20","v":"--summer period (arctic or severe weather conditions)"},{"$f":"'Methods&Limits'!B20","v":"kPa"},{"$f":"'Methods&Limits'!E20","v":"EN 13016-1"},{"$f":"'Methods&Limits'!F20","v":2018},{"$f":"'Methods&Limits'!G20","v":2.2999999999999998},null,{"$f":"'Methods&Limits'!I20","v":71.356999999999999},{"$f":"IF(E20>G73,\"Yes\",\"\")","v":""}]
[{"$f":"'Methods&Limits'!A21","v":"Distillation *"}]
[{"$f":"'Methods&Limits'!A22","v":"--evaporated at 100 oC"},{"$f":"'Methods&Limits'!B22","v":"% V/V"},{"$f":"'Methods&Limits'!E22","v":"EN-ISO 3405"},{"$f":"'Methods&Limits'!F22","v":2020},{"$f":"'Methods&Limits'!G22","v":4},{"$f":"'Methods&Limits'!H22","v":43.64},null,{"$f":"IF(D22=\"\",\"\",IF(D22<F75,\"Yes\",\"\"))","v":"Yes"}]
[{"$f":"'Methods&Limits'!A23","v":"-- evaporated at 150 oC "},{"$f":"'Methods&Limits'!B23","v":"% V/V"},{"$f":"'Methods&Limits'!E23","v":"EN-ISO 3405"},{"$f":"'Methods&Limits'!F23","v":2020},{"$f":"'Methods&Limits'!G23","v":4},{"$f":"'Methods&Limits'!H23","v":72.64},null,{"$f":"IF(D23=\"\",\"\",IF(D23<F76,\"Yes\",\"\"))","v":"Yes"}]
[{"$f":"'Methods&Limits'!A24","v":"Hydrocarbon analysis"},null,null,null,null,null,null,{"$f":"IF(D24<F77,\"Yes\",\"\")","v":""}]
[{"$f":"'Methods&Limits'!A25","v":"-- Olefins"},{"$f":"'Methods&Limits'!B25","v":"% V/V"},{"$f":"'Methods&Limits'!E25","v":"EN 15553"},{"$f":"'Methods&Limits'!F25","v":2021},{"$f":"'Methods&Limits'!G25","v":6.4},null,{"$f":"'Methods&Limits'!I25","v":21.776},{"$f":"IF($E$25>G78,\"Yes\",\"\")","v":""}]
[null,null,{"$f":"'Methods&Limits'!E26","v":"EN-ISO 22854"},{"$f":"'Methods&Limits'!F26","v":2021},{"$f":"'Methods&Limits'!G26","v":2.6},null,{"$f":"'Methods&Limits'!I26","v":19.533999999999999},{"$f":"IF($E$25>G79,\"Yes\",\"\")","v":""}]
[{"$f":"'Methods&Limits'!A27","v":"*without oxygenates"},null,{"$f":"'Methods&Limits'!E27","v":"EN 15553"},{"$f":"'Methods&Limits'!F27","v":2021},{"$f":"'Methods&Limits'!G27","v":"-"},null,{"$f":"'Methods&Limits'!I27","v":"-"},{"$f":"IF($E$25>G80,\"Yes\",\"\")","v":""}]
[null,null,{"$f":"'Methods&Limits'!E28","v":"EN-ISO 22854"},{"$f":"'Methods&Limits'!F28","v":2021},{"$f":"'Methods&Limits'!G28","v":"-"},null,{"$f":"'Methods&Limits'!I28","v":"-"},{"$f":"IF($E$25>G81,\"Yes\",\"\")","v":""}]
[{"$f":"'Methods&Limits'!A29","v":"-- Olefins (RON 91 fuel only)***"},{"$f":"'Methods&Limits'!B29","v":"% V/V"},{"$f":"'Methods&Limits'!E29","v":"ASTM D1319"},{"$f":"'Methods&Limits'!F29","v":2020},{"$f":"'Methods&Limits'!G29","v":5.0999999999999996},null,{"$f":"'Methods&Limits'!I29","v":24.009},{"$f":"IF($E$25>G82,\"Yes\",\"\")","v":""}]
[{"$f":"'Methods&Limits'!A30","v":"-- Aromatics (from 2005)"},null,{"$f":"'Methods&Limits'!E30","v":"EN-ISO 22854"},{"$f":"'Methods&Limits'!F30","v":2021},{"$f":"'Methods&Limits'!G30","v":1.7},null,{"$f":"'Methods&Limits'!I30","v":36.003},{"$f":"IF($E$26>G83,\"Yes\",\"\")","v":""}]
[{"$f":"'Methods&Limits'!A31","v":"-- Benzene"},{"$f":"'Methods&Limits'!B31","v":"% V/V"},{"$f":"'Methods&Limits'!E31","v":"EN 12177"},{"$f":"'Methods&Limits'!F31","v":2022},{"$f":"'Methods&Limits'!G31","v":0.1},null,{"$f":"'Methods&Limits'!I31","v":1.0589999999999999},{"$f":"IF(E27>G84,\"Yes\",\"\")","v":""}]
[null,null,{"$f":"'Methods&Limits'!E32","v":"EN 238"},{"$f":"'Methods&Limits'!F32","v":1996},{"$f":"'Methods&Limits'!G32","v":0.17},null,{"$f":"'Methods&Limits'!I32","v":1.1003000000000001},{"$f":"IF(E27>G85,\"Yes\",\"\")","v":""}]
[null,null,{"$f":"'Methods&Limits'!E33","v":"EN-ISO 22854"},{"$f":"'Methods&Limits'!F33","v":2021},{"$f":"'Methods&Limits'!G33","v":0.05},null,{"$f":"'Methods&Limits'!I33","v":1.0295000000000001},{"$f":"IF(E27>G86,\"Yes\",\"\")","v":""}]
[{"$f":"'Methods&Limits'!A34","v":"Oxygen content"},{"$f":"'Methods&Limits'!B34","v":"% (m/m)"},{"$f":"'Methods&Limits'!E34","v":"EN 1601"},{"$f":"'Methods&Limits'!F34","v":2017},{"$f":"'Methods&Limits'!G34","v":0.41},null,{"$f":"'Methods&Limits'!I34","v":3.9419},{"$f":"IF(E28>G87,\"Yes\",\"\")","v":""}]
[null,null,{"$f":"'Methods&Limits'!E35","v":"EN 1601"},{"$f":"'Methods&Limits'!F35","v":2017},{"$f":"'Methods&Limits'!G35","v":0.41},null,{"$f":"'Methods&Limits'!I35","v":2.9419},{"$f":"IF(E29>G88,\"Yes\",\"\")","v":""}]
[{"$f":"'Methods&Limits'!A36","v":"Oxygenates"}]
[{"$f":"'Methods&Limits'!A37","v":"-- Methanol"},{"$f":"'Methods&Limits'!B37","v":"% V/V"},{"$f":"'Methods&Limits'!E37","v":"EN 1601"},{"$f":"'Methods&Limits'!F37","v":2017},{"$f":"'Methods&Limits'!G37","v":0.3},null,{"$f":"'Methods&Limits'!I37","v":3.177},{"$f":"IF(E31>G90,\"Yes\",\"\")","v":""}]
[{"$f":"'Methods&Limits'!A38","v":"-- Ethanol"},{"$f":"'Methods&Limits'!B38","v":"% V/V"},{"$f":"'Methods&Limits'!E38","v":"EN 1601"},{"$f":"'Methods&Limits'!F38","v":2017},{"$f":"'Methods&Limits'!G38","v":0.8},null,{"$f":"'Methods&Limits'!I38","v":10.472},""]
[{"$f":"'Methods&Limits'!A39","v":"-- Iso-propyl alcohol"},{"$f":"'Methods&Limits'!B39","v":"% V/V"},{"$f":"'Methods&Limits'!E39","v":"EN 1601"},{"$f":"'Methods&Limits'!F39","v":2017},{"$f":"'Methods&Limits'!G39","v":0.9},null,{"$f":"'Methods&Limits'!I39","v":12.531000000000001},""]
[{"$f":"'Methods&Limits'!A40","v":"-- Tert-butyl alcohol"},{"$f":"'Methods&Limits'!B40","v":"% V/V"},{"$f":"'Methods&Limits'!E40","v":"EN 1601"},{"$f":"'Methods&Limits'!F40","v":2017},{"$f":"'Methods&Limits'!G40","v":1},null,{"$f":"'Methods&Limits'!I40","v":15.59},""]
[{"$f":"'Methods&Limits'!A41","v":"-- Iso-butyl alcohol"},{"$f":"'Methods&Limits'!B41","v":"% V/V"},{"$f":"'Methods&Limits'!E41","v":"EN 1601"},{"$f":"'Methods&Limits'!F41","v":2017},{"$f":"'Methods&Limits'!G41","v":1},null,{"$f":"'Methods&Limits'!I41","v":15.59},""]
[{"$f":"'Methods&Limits'!A42","v":"-- Ethers with 5 or more carbon atoms per molecule"},{"$f":"'Methods&Limits'!B42","v":"% V/V"},{"$f":"'Methods&Limits'!E42","v":"EN 1601"},{"$f":"'Methods&Limits'!F42","v":2017},{"$f":"'Methods&Limits'!G42","v":1},null,{"$f":"'Methods&Limits'!I42","v":22.59},""]
[{"$f":"'Methods&Limits'!A43","v":"-- other oxygenates"},{"$f":"'Methods&Limits'!B43","v":"% V/V"},{"$f":"'Methods&Limits'!E43","v":"EN 1601"},{"$f":"'Methods&Limits'!F43","v":2017},{"$f":"'Methods&Limits'!G43","v":1},null,{"$f":"'Methods&Limits'!I43","v":15.59},""]
[{"$f":"'Methods&Limits'!A44","v":"Oxygen content"},{"$f":"'Methods&Limits'!B44","v":"% (m/m)"},{"$f":"'Methods&Limits'!E44","v":"EN 13132"},{"$f":"'Methods&Limits'!F44","v":2002},{"$f":"'Methods&Limits'!G44","v":0.3},null,{"$f":"'Methods&Limits'!I44","v":3.8770000000000002},{"$f":"IF(E28>G97,\"Yes\",\"\")","v":""}]
[null,null,{"$f":"'Methods&Limits'!E45","v":"EN 13132"},{"$f":"'Methods&Limits'!F45","v":2002},{"$f":"'Methods&Limits'!G45","v":0.3},null,{"$f":"'Methods&Limits'!I45","v":2.8770000000000002},{"$f":"IF(E29>G98,\"Yes\",\"\")","v":""}]
[{"$f":"'Methods&Limits'!A46","v":"Oxygenates"}]
[{"$f":"'Methods&Limits'!A47","v":"-- Methanol"},{"$f":"'Methods&Limits'!B47","v":"% V/V"},{"$f":"'Methods&Limits'!E47","v":"EN 13132"},{"$f":"'Methods&Limits'!F47","v":2002},{"$f":"'Methods&Limits'!G47","v":0.3},null,{"$f":"'Methods&Limits'!I47","v":3.177},{"$f":"IF(E31>G100,\"Yes\",\"\")","v":""}]
[{"$f":"'Methods&Limits'!A48","v":"-- Ethanol"},{"$f":"'Methods&Limits'!B48","v":"% V/V"},{"$f":"'Methods&Limits'!E48","v":"EN 13132"},{"$f":"'Methods&Limits'!F48","v":2002},{"$f":"'Methods&Limits'!G48","v":0.8},null,{"$f":"'Methods&Limits'!I48","v":10.472},""]
[{"$f":"'Methods&Limits'!A49","v":"-- Iso-propyl alcohol"},{"$f":"'Methods&Limits'!B49","v":"% V/V"},{"$f":"'Methods&Limits'!E49","v":"EN 13132"},{"$f":"'Methods&Limits'!F49","v":2002},{"$f":"'Methods&Limits'!G49","v":0.8},null,{"$f":"'Methods&Limits'!I49","v":12.472},""]
[{"$f":"'Methods&Limits'!A50","v":"-- Tert-butyl alcohol"},{"$f":"'Methods&Limits'!B50","v":"% V/V"},{"$f":"'Methods&Limits'!E50","v":"EN 13132"},{"$f":"'Methods&Limits'!F50","v":2002},{"$f":"'Methods&Limits'!G50","v":1},null,{"$f":"'Methods&Limits'!I50","v":15.59},""]
[{"$f":"'Methods&Limits'!A51","v":"-- Iso-butyl alcohol"},{"$f":"'Methods&Limits'!B51","v":"% V/V"},{"$f":"'Methods&Limits'!E51","v":"EN 13132"},{"$f":"'Methods&Limits'!F51","v":2002},{"$f":"'Methods&Limits'!G51","v":1},null,{"$f":"'Methods&Limits'!I51","v":15.59},""]
[{"$f":"'Methods&Limits'!A52","v":"-- Ethers with 5 or more carbon atoms per molecule"},{"$f":"'Methods&Limits'!B52","v":"% V/V"},{"$f":"'Methods&Limits'!E52","v":"EN 13132"},{"$f":"'Methods&Limits'!F52","v":2002},{"$f":"'Methods&Limits'!G52","v":1},null,{"$f":"'Methods&Limits'!I52","v":22.59},""]
[{"$f":"'Methods&Limits'!A53","v":"-- other oxygenates"},{"$f":"'Methods&Limits'!B53","v":"% V/V"},{"$f":"'Methods&Limits'!E53","v":"EN 13132"},{"$f":"'Methods&Limits'!F53","v":2002},{"$f":"'Methods&Limits'!G53","v":1},null,{"$f":"'Methods&Limits'!I53","v":15.59},""]
[{"$f":"'Methods&Limits'!A54","v":"Oxygen content"},{"$f":"'Methods&Limits'!B54","v":"% (m/m)"},{"$f":"'Methods&Limits'!E54","v":"EN-ISO 22854"},{"$f":"'Methods&Limits'!F54","v":2021},{"$f":"'Methods&Limits'!G54","v":0.4},null,{"$f":"'Methods&Limits'!I54","v":3.9359999999999999},{"$f":"IF(E28>G107,\"Yes\",\"\")","v":""}]
[null,null,{"$f":"'Methods&Limits'!E55","v":"EN-ISO 22854"},{"$f":"'Methods&Limits'!F55","v":2021},{"$f":"'Methods&Limits'!G55","v":0.4},null,{"$f":"'Methods&Limits'!I55","v":2.9359999999999999},{"$f":"IF(E29>G108,\"Yes\",\"\")","v":""}]
[{"$f":"'Methods&Limits'!A56","v":"Oxyginates"}]
[{"$f":"'Methods&Limits'!A57","v":"-- Methanol"},{"$f":"'Methods&Limits'!B57","v":"% V/V"},{"$f":"'Methods&Limits'!E57","v":"EN-ISO 22854"},{"$f":"'Methods&Limits'!F57","v":2021},{"$f":"'Methods&Limits'!G57","v":0.4},null,{"$f":"'Methods&Limits'!I57","v":3.2359999999999998},{"$f":"IF(E31>G110,\"Yes\",\"\")","v":""}]
[{"$f":"'Methods&Limits'!A58","v":"-- Ethanol"},{"$f":"'Methods&Limits'!B58","v":"% V/V"},{"$f":"'Methods&Limits'!E58","v":"EN-ISO 22854"},{"$f":"'Methods&Limits'!F58","v":2021},{"$f":"'Methods&Limits'!G58","v":0.6},null,{"$f":"'Methods&Limits'!I58","v":10.353999999999999},""]
[{"$f":"'Methods&Limits'!A59","v":"-- Iso-propyl alcohol"},{"$f":"'Methods&Limits'!B59","v":"% V/V"},{"$f":"'Methods&Limits'!E59","v":"EN-ISO 22854"},{"$f":"'Methods&Limits'!F59","v":2021},{"$f":"'Methods&Limits'!G59","v":0.7},null,{"$f":"'Methods&Limits'!I59","v":12.413},""]
[{"$f":"'Methods&Limits'!A60","v":"-- Tert-butyl alcohol"},{"$f":"'Methods&Limits'!B60","v":"% V/V"},{"$f":"'Methods&Limits'!E60","v":"EN-ISO 22854"},{"$f":"'Methods&Limits'!F60","v":2021},{"$f":"'Methods&Limits'!G60","v":0.7},null,{"$f":"'Methods&Limits'!I60","v":15.413},""]
[{"$f":"'Methods&Limits'!A61","v":"-- Iso-butyl alcohol"},{"$f":"'Methods&Limits'!B61","v":"% V/V"},{"$f":"'Methods&Limits'!E61","v":"EN-ISO 22854"},{"$f":"'Methods&Limits'!F61","v":2021},{"$f":"'Methods&Limits'!G61","v":0.7},null,{"$f":"'Methods&Limits'!I61","v":15.413},""]
[{"$f":"'Methods&Limits'!A62","v":"-- Ethers with 5 or more carbon atoms per molecule"},{"$f":"'Methods&Limits'!B62","v":"% V/V"},{"$f":"'Methods&Limits'!E62","v":"EN-ISO 22854"},{"$f":"'Methods&Limits'!F62","v":2021},{"$f":"'Methods&Limits'!G62","v":0.9},null,{"$f":"'Methods&Limits'!I62","v":22.530999999999999},""]
[{"$f":"'Methods&Limits'!A63","v":"-- other oxygenates"},{"$f":"'Methods&Limits'!B63","v":"% V/V"},{"$f":"'Methods&Limits'!E63","v":"EN-ISO 22854"},{"$f":"'Methods&Limits'!F63","v":2021},{"$f":"'Methods&Limits'!G63","v":0.7},null,{"$f":"'Methods&Limits'!I63","v":15.413},""]
[{"$f":"'Methods&Limits'!A64:A64","v":"Sulphur content (sulphur free, from 2005)**"},{"$f":"'Methods&Limits'!B64","v":"mg/kg"},{"$f":"'Methods&Limits'!E64","v":"EN-ISO 14596"},{"$f":"'Methods&Limits'!F64","v":2018},{"$f":"'Methods&Limits'!G64","v":5},null,{"$f":"'Methods&Limits'!I64","v":12.95},{"$f":"IF(E$38>G117,\"Yes\",\"\")","v":""}]
[null,null,{"$f":"'Methods&Limits'!E65","v":"EN 24260"},{"$f":"'Methods&Limits'!F65","v":1994},{"$f":"'Methods&Limits'!G65","v":1},null,{"$f":"'Methods&Limits'!I65","v":10.59},{"$f":"IF(E$38>G118,\"Yes\",\"\")","v":""}]
[null,null,{"$f":"'Methods&Limits'!E66","v":"EN-ISO 20846"},{"$f":"'Methods&Limits'!F66","v":2019},{"$f":"'Methods&Limits'!G66","v":2.7},null,{"$f":"'Methods&Limits'!I66","v":11.593},{"$f":"IF(E$38>G119,\"Yes\",\"\")","v":""}]
[null,null,{"$f":"'Methods&Limits'!E67","v":"EN-ISO 20884"},{"$f":"'Methods&Limits'!F67","v":2019},{"$f":"'Methods&Limits'!G67","v":3.1},null,{"$f":"'Methods&Limits'!I67","v":11.829000000000001},{"$f":"IF(E$38>G120,\"Yes\",\"\")","v":""}]
[{"$f":"'Methods&Limits'!A68:A68","v":"Lead content"},{"$f":"'Methods&Limits'!B68","v":"g/l"},{"$f":"'Methods&Limits'!E68","v":"EN 237"},{"$f":"'Methods&Limits'!F68","v":2004},{"$f":"'Methods&Limits'!G68","v":6.1999999999999998E-3},null,{"$f":"'Methods&Limits'!I68","v":8.657999999999999E-3},{"$f":"IF($E$39>G121,\"Yes\",\"\")","v":""}]

{"sheet":"Petrol (6)","index":20,"n_rows":121,"n_cols":18,"rows_kept":121,"cut":false,"hidden":false,"merged":[[2,1,2,4],[2,6,9,16],[3,1,3,4],[4,1,4,4],[5,1,5,4],[6,1,6,4],[7,2,7,4],[13,2,14,10],[13,11,13,14],[13,15,13,16],[14,11,14,12],[14,13,14,14],[14,15,14,16],[58,2,58,8],[58,9,58,12],[20,15,22,15],[27,15,28,15],[27,16,28,16],[43,0,43,3],[44,4,45,11],[46,4,46,11],[47,4,47,11],[48,4,48,11],[49,4,49,11],[50,4,50,11],[53,0,53,11],[71,11,71,12],[59,5,59,6],[59,9,60,9],[61,11,61,12],[62,11,62,12],[63,11,63,12],[64,11,64,12],[66,11,66,12],[67,11,67,12],[68,11,68,12],[69,11,69,12],[70,11,70,12],[59,11,59,12],[85,11,85,12],[72,11,72,12],[74,11,74,12],[75,11,75,12],[77,11,77,12],[78,11,78,12],[79,11,79,12],[80,11,80,12],[81,11,81,12],[82,11,82,12],[83,11,83,12],[84,11,84,12],[99,11,99,12],[86,11,86,12],[87,11,87,12],[89,11,89,12],[90,11,90,12],[91,11,91,12],[92,11,92,12],[93,11,93,12],[94,11,94,12],[95,11,95,12],[96,11,96,12],[97,11,97,12],[112,11,112,12],[100,11,100,12],[101,11,101,12],[102,11,102,12],[103,11,103,12],[104,11,104,12],[105,11,105,12],[106,11,106,12],[107,11,107,12],[109,11,109,12],[110,11,110,12],[111,11,111,12],[119,11,119,12],[120,11,120,12],[121,11,121,12],[122,11,122,12],[113,11,113,12],[114,11,114,12],[115,11,115,12],[116,11,116,12],[117,11,117,12],[118,11,118,12]]}
["Market Fuels used in Vehicles with Spark Ignition Engines (Petrol)",null,null,null,null,null,null,null,null,null,null,null,null,null,null,null,null,"<-- GO BACK"]
[]
["Country",{"$f":"IF(LEN('Contacts&Annual Summary'!C9) > 1,'Contacts&Annual Summary'!C9,\"\")","v":""},null,null,null,null,"Notes on completing the tables\nThe table structure has been locked to prevent modification - data can be copied and pasted, in bulk into the Reporting Results blue table cells.  Where a white row exists between rows, it will not be possible to paste over white rows and sections should be pasted separately.\n\nColumn H in the Test Methods and Analysis table is set to automatically check whether the values entered in the Reporting Results table exceed maximum or minimum Tolerance Limits.  If any exceedance is detected, please provide details in the columns to the right including the number of samples, location samples were taken from, Values and Details of any action taken to address non-compliant samples.  Compliance information is verified manually and this automated compliance check is not solely relied upon during data analysis.\n\nPlease do not unlock this template - modified templates cannot be processed and may delay reporting."]
["Reporting Year",{"$f":"'Contacts&Annual Summary'!C8","v":2023}]
["Period (Summer or Winter)","Winter"]
["Parent fuel grade","Petrol"]
["National fuel grade",{"$f":"'Petrol (5)'!B7","v":0}]
["Summer Period (N or A)*",0,{"$f":"IF( B8=\"A\",\"1st June to 31st August (arctic)\",\"1st May to 30th September (normal)\")","v":"1st May to 30th September (normal)"}]
["The maximum bioethanol content (% v/v)",0,"Please include the bioethanol content as a numerical figure in % V/V"]
["* N = 1st May to 30th September (normal) ; A = 1st June to 31st August (arctic)."]
[]
["Reporting results"]
[]
["Parameter","Unit","Analytical and statistical results \n(Please see an explanation and examples for new columns/ information required in Cells I15 to K37 on the Introduction & Instructions tab).",null,null,null,null,null,null,null,null,"Limiting Value (1)",null,null,null,"Test method"]
[null,null,null,null,null,null,null,null,null,null,null,"National Specification, if any",null,"According to Directive 2009/30/EC",null,"(more recent versions may also be used)"]
[null,null,"No Samples","Minimum","Maximum","Median","Mean","Standard Deviation","No Samples outside 95% tolerance limit","25% of Sample Value","75% of Sample Value","Minimum","Maximum","Minimum","Maximum","Method","Date"]
["Research Octane Number","--",0,0,0,0,0,0,0,0,0,null,null,"95 (2)",null,"EN-ISO 5164",2005]
["Motor Octane Number","--",0,0,0,0,0,0,0,0,0,null,null,"85 (3)",null,"EN-ISO 5163",2005]
["Vapour Pressure, DVPE (6)","kPa",null,null,null,null,null,null,null,null,null,null,null,null,"(4)"]
["-- required for summer period only",null,0,0,0,0,0,0,0,0,0,null,null,null,{"$f":"IF(E8=\"A\",70,60)","v":60},"EN 13106-1",2007]
["Distillation",null,null,null,null,null,null,null,null,null,null,null,null,null,null,"EN-ISO 3405"]
["-- evaporated at 100 oC","% V/V",0,0,0,0,0,0,0,0,0,null,null,46,null,null,2000]
["-- evaporated at 150 oC ","% V/V",0,0,0,0,0,0,0,0,0,null,null,75]
["Hydrocarbon analysis"]
["-- Olefins","% V/V",0,0,0,0,0,0,0,0,0,null,null,null,"18.0 (5)","ASTM D 1319\nEN 15553\nEN-ISO 22854","1995\n2007\n2008"]
["-- Aromatics","% V/V",0,0,0,0,0,0,0,0,0,null,null,null,35,"EN-ISO 22854","1995\n2008"]
["-- Benzene","% V/V",0,0,0,0,0,0,0,0,0,null,null,null,1,"EN 238\nEN 12177\nEN-ISO 22854","1996\n1998\n2008"]
[{"$f":"IF(C29>0,\"Do not complete\",\"Oxygen content\")","v":"Oxygen content"},"% (m/m)",0,0,0,0,0,0,0,0,0,null,null,null,3.7,"EN 1601\nEN 13132\nEN-ISO 22854","1997\n2000\n2008"]
[{"$f":"IF(C28>0,\"Do not complete\",\"Oxygen content*\n*petrol with 5% (v/v) or less ethanol content\")","v":"Oxygen content*\n*petrol with 5% (v/v) or less ethanol content"},"% (m/m)",0,0,0,0,0,0,0,0,0,null,null,null,2.7]
["Oxygenates"]
["-- Methanol","% V/V",0,0,0,0,0,0,0,0,0,null,null,null,3]
["-- Ethanol","% V/V",0,0,0,0,0,0,0,0,0,null,null,null,10]
["-- Iso-propyl alcohol","% V/V",0,0,0,0,0,0,0,0,0,null,null,null,12,"EN 1601",1997]
["-- Tert-butyl alcohol","% V/V",0,0,0,0,0,0,0,0,0,null,null,null,15,"EN 13132",2000]
["-- Iso-butyl alcohol","% V/V",0,0,0,0,0,0,0,0,0,null,null,null,15,"EN-ISO 22854",2008]
["-- Ethers with ≥5 carbon atoms / molecule","% V/V",0,0,0,0,0,0,0,0,0,null,null,null,22]
["-- other oxygenates","% V/V",0,0,0,0,0,0,0,0,0,null,null,null,15]
["Sulphur content","mg/kg",0,0,0,0,0,0,0,0,0,null,null,null,10,"EN-ISO 14596\nEN 24260\nEN-ISO 20846\nEN-ISO 20884","1998\n1994\n2004\n2004"]
["Lead content","g/l",0,0,0,0,0,0,0,0,0,null,null,null,5.0000000000000001E-3,"EN 237",1996]
[]
[]
["Sampling frequency"]
[]
["Number of samples in month"]
["January",0,"July",0,"(1) The limiting values are \"true values\" and were established according to the procedures for limit setting in EN 228:2008  The results of individual measurements shall be interpreted following the criteria described in EN 228:2008."]
["February",0,"August",0]
["March",0,"September",0,"(2) 91 for unleaded regular grade petrol: See 2009/30/EC Annex I, Footnote 3."]
["April",0,"October",0,"(3) 81 for unleaded regular grade petrol: See 2009/30/EC Annex I, Footnote 3."]
["May",0,"November",0,"(4) 70 kPa for Member States with arctic or severe weather conditions: See 2003/30/EC Annex I, Footnotes 4 & 5."]
["June",0,"December",0,"(5) 21 for unleaded regular grade petrol: See 98/70/EC, Annex I, Footnote 6."]
[null,null,"Winter Months Total",{"$f":"SUM(B45:B50,D45:D50)","v":0},"(6) Vapour pressure waiver applies for petrol containing Bioethanol, see 2009/30/EC Annex I, Footnote 5 and Annex III."]
[]
["Other notes (optional):"]
[]
[]
[]
["Test Methods and Analysis"]
[]
["Parameter","Unit","Test specified in 2009/30/EC or EN228:2008",null,null,null,null,null,null,"Notes on exceedences"]
[null,null,"Method","Date","Reproducability, R","Tolerance limits",null,null,null,"Sample location (S,T or R)","Values","Details/action taken"]
[null,null,null,null,null,"Minimum","Maximum","Exceeded?"]
[{"$f":"'Methods&Limits'!A9","v":"Research Octane Number (RON)"},{"$f":"'Methods&Limits'!B9","v":"--"},{"$f":"'Methods&Limits'!E9","v":"EN-ISO 5164"},{"$f":"'Methods&Limits'!F9","v":2014},{"$f":"'Methods&Limits'!G9","v":0.7},{"$f":"'Methods&Limits'!H9","v":94.587000000000003},null,{"$f":"IF(D17=\"\",\"\",IF(D17<F62,\"Yes\",\"\"))","v":"Yes"}]
[{"$f":"'Methods&Limits'!A10","v":"(RON 91 fuel only)"},{"$f":"'Methods&Limits'!B10","v":"--"},{"$f":"'Methods&Limits'!E10","v":"EN-ISO 5164"},{"$f":"'Methods&Limits'!F10","v":2014},{"$f":"'Methods&Limits'!G10","v":0.7},{"$f":"'Methods&Limits'!H10","v":90.587000000000003},null,{"$f":"IF(D17=\"\",\"\",IF(D17<F63,\"Yes\",\"\"))","v":"Yes"}]
[{"$f":"'Methods&Limits'!A11","v":"Motor Octane Number (MON)"},{"$f":"'Methods&Limits'!B11","v":"--"},{"$f":"'Methods&Limits'!E11","v":"EN-ISO 5163"},{"$f":"'Methods&Limits'!F11","v":2014},{"$f":"'Methods&Limits'!G11","v":0.9},{"$f":"'Methods&Limits'!H11","v":84.468999999999994},null,{"$f":"IF(D18=\"\",\"\",IF(D18<F64,\"Yes\",\"\"))","v":"Yes"}]
[{"$f":"'Methods&Limits'!A12","v":"(RON 91 fuel only)"},{"$f":"'Methods&Limits'!B12","v":"--"},{"$f":"'Methods&Limits'!E12","v":"EN-ISO 5163"},{"$f":"'Methods&Limits'!F12","v":2014},{"$f":"'Methods&Limits'!G12","v":0.9},{"$f":"'Methods&Limits'!H12","v":80.468999999999994},null,{"$f":"IF(D18=\"\",\"\",IF(D18<F65,\"Yes\",\"\"))","v":"Yes"}]
[{"$f":"'Methods&Limits'!A13","v":"Vapour Pressure, DVPE"}]
[{"$f":"'Methods&Limits'!A14","v":"--summer period (normal)"},{"$f":"'Methods&Limits'!B14","v":"kPa"},{"$f":"'Methods&Limits'!E14","v":"EN 13016-1"},{"$f":"'Methods&Limits'!F14","v":2018},{"$f":"'Methods&Limits'!G14","v":2.2000000000000002},null,{"$f":"'Methods&Limits'!I14","v":61.298000000000002}]
[{"$f":"'Methods&Limits'!A15","v":"-- Petrol with bioethanol content 0-2"},{"$f":"'Methods&Limits'!B15","v":"kPa"},{"$f":"'Methods&Limits'!E15","v":"EN 1601"},{"$f":"'Methods&Limits'!F15","v":2017},{"$f":"'Methods&Limits'!G15","v":2.2999999999999998},null,{"$f":"'Methods&Limits'!I15","v":67.307000000000002}]
[{"$f":"'Methods&Limits'!A16","v":"-- Petrol with bioethanol content 2-4"},{"$f":"'Methods&Limits'!B16","v":"kPa"},{"$f":"'Methods&Limits'!E16","v":"EN 1601"},{"$f":"'Methods&Limits'!F16","v":2017},{"$f":"'Methods&Limits'!G16","v":2.2999999999999998},null,{"$f":"'Methods&Limits'!I16","v":69.156999999999996}]
[{"$f":"'Methods&Limits'!A17","v":"-- Petrol with bioethanol content 4-6"},{"$f":"'Methods&Limits'!B17","v":"kPa"},{"$f":"'Methods&Limits'!E17","v":"EN 1601"},{"$f":"'Methods&Limits'!F17","v":2017},{"$f":"'Methods&Limits'!G17","v":2.2999999999999998},null,{"$f":"'Methods&Limits'!I17","v":69.356999999999999}]
[{"$f":"'Methods&Limits'!A18","v":"-- Petrol with bioethanol content 6-8"},{"$f":"'Methods&Limits'!B18","v":"kPa"},{"$f":"'Methods&Limits'!E18","v":"EN 1601"},{"$f":"'Methods&Limits'!F18","v":2017},{"$f":"'Methods&Limits'!G18","v":2.2999999999999998},null,{"$f":"'Methods&Limits'!I18","v":69.236999999999995}]
[{"$f":"'Methods&Limits'!A19","v":"-- Petrol with bioethanol content 8-10"},{"$f":"'Methods&Limits'!B19","v":"kPa"},{"$f":"'Methods&Limits'!E19","v":"EN 1601"},{"$f":"'Methods&Limits'!F19","v":2017},{"$f":"'Methods&Limits'!G19","v":2.2999999999999998},null,{"$f":"'Methods&Limits'!I19","v":69.117000000000004}]
[{"$f":"'Methods&Limits'!A20","v":"--summer period (arctic or severe weather conditions)"},{"$f":"'Methods&Limits'!B20","v":"kPa"},{"$f":"'Methods&Limits'!E20","v":"EN 13016-1"},{"$f":"'Methods&Limits'!F20","v":2018},{"$f":"'Methods&Limits'!G20","v":2.2999999999999998},null,{"$f":"'Methods&Limits'!I20","v":71.356999999999999}]
[{"$f":"'Methods&Limits'!A21","v":"Distillation *"}]
[{"$f":"'Methods&Limits'!A22","v":"--evaporated at 100 oC"},{"$f":"'Methods&Limits'!B22","v":"% V/V"},{"$f":"'Methods&Limits'!E22","v":"EN-ISO 3405"},{"$f":"'Methods&Limits'!F22","v":2020},{"$f":"'Methods&Limits'!G22","v":4},{"$f":"'Methods&Limits'!H22","v":43.64},null,{"$f":"IF(D22=\"\",\"\",IF(D22<F75,\"Yes\",\"\"))","v":"Yes"}]
[{"$f":"'Methods&Limits'!A23","v":"-- evaporated at 150 oC "},{"$f":"'Methods&Limits'!B23","v":"% V/V"},{"$f":"'Methods&Limits'!E23","v":"EN-ISO 3405"},{"$f":"'Methods&Limits'!F23","v":2020},{"$f":"'Methods&Limits'!G23","v":4},{"$f":"'Methods&Limits'!H23","v":72.64},null,{"$f":"IF(D23=\"\",\"\",IF(D23<F76,\"Yes\",\"\"))","v":"Yes"}]
[{"$f":"'Methods&Limits'!A24","v":"Hydrocarbon analysis"},null,null,null,null,null,null,{"$f":"IF(D24<F77,\"Yes\",\"\")","v":""}]
[{"$f":"'Methods&Limits'!A25","v":"-- Olefins"},{"$f":"'Methods&Limits'!B25","v":"% V/V"},{"$f":"'Methods&Limits'!E25","v":"EN 15553"},{"$f":"'Methods&Limits'!F25","v":2021},{"$f":"'Methods&Limits'!G25","v":6.4},null,{"$f":"'Methods&Limits'!I25","v":21.776},{"$f":"IF($E$25>G78,\"Yes\",\"\")","v":""}]
[null,null,{"$f":"'Methods&Limits'!E26","v":"EN-ISO 22854"},{"$f":"'Methods&Limits'!F26","v":2021},{"$f":"'Methods&Limits'!G26","v":2.6},null,{"$f":"'Methods&Limits'!I26","v":19.533999999999999},{"$f":"IF($E$25>G79,\"Yes\",\"\")","v":""}]
[{"$f":"'Methods&Limits'!A27","v":"*without oxygenates"},null,{"$f":"'Methods&Limits'!E27","v":"EN 15553"},{"$f":"'Methods&Limits'!F27","v":2021},{"$f":"'Methods&Limits'!G27","v":"-"},null,{"$f":"'Methods&Limits'!I27","v":"-"},{"$f":"IF($E$25>G80,\"Yes\",\"\")","v":""}]
[null,null,{"$f":"'Methods&Limits'!E28","v":"EN-ISO 22854"},{"$f":"'Methods&Limits'!F28","v":2021},{"$f":"'Methods&Limits'!G28","v":"-"},null,{"$f":"'Methods&Limits'!I28","v":"-"},{"$f":"IF($E$25>G81,\"Yes\",\"\")","v":""}]
[{"$f":"'Methods&Limits'!A29","v":"-- Olefins (RON 91 fuel only)***"},{"$f":"'Methods&Limits'!B29","v":"% V/V"},{"$f":"'Methods&Limits'!E29","v":"ASTM D1319"},{"$f":"'Methods&Limits'!F29","v":2020},{"$f":"'Methods&Limits'!G29","v":5.0999999999999996},null,{"$f":"'Methods&Limits'!I29","v":24.009},{"$f":"IF($E$25>G82,\"Yes\",\"\")","v":""}]
[{"$f":"'Methods&Limits'!A30","v":"-- Aromatics (from 2005)"},null,{"$f":"'Methods&Limits'!E30","v":"EN-ISO 22854"},{"$f":"'Methods&Limits'!F30","v":2021},{"$f":"'Methods&Limits'!G30","v":1.7},null,{"$f":"'Methods&Limits'!I30","v":36.003},{"$f":"IF($E$26>G83,\"Yes\",\"\")","v":""}]
[{"$f":"'Methods&Limits'!A31","v":"-- Benzene"},{"$f":"'Methods&Limits'!B31","v":"% V/V"},{"$f":"'Methods&Limits'!E31","v":"EN 12177"},{"$f":"'Methods&Limits'!F31","v":2022},{"$f":"'Methods&Limits'!G31","v":0.1},null,{"$f":"'Methods&Limits'!I31","v":1.0589999999999999},{"$f":"IF(E27>G84,\"Yes\",\"\")","v":""}]
[null,null,{"$f":"'Methods&Limits'!E32","v":"EN 238"},{"$f":"'Methods&Limits'!F32","v":1996},{"$f":"'Methods&Limits'!G32","v":0.17},null,{"$f":"'Methods&Limits'!I32","v":1.1003000000000001},{"$f":"IF(E27>G85,\"Yes\",\"\")","v":""}]
[null,null,{"$f":"'Methods&Limits'!E33","v":"EN-ISO 22854"},{"$f":"'Methods&Limits'!F33","v":2021},{"$f":"'Methods&Limits'!G33","v":0.05},null,{"$f":"'Methods&Limits'!I33","v":1.0295000000000001},{"$f":"IF(E27>G86,\"Yes\",\"\")","v":""}]
[{"$f":"'Methods&Limits'!A34","v":"Oxygen content"},{"$f":"'Methods&Limits'!B34","v":"% (m/m)"},{"$f":"'Methods&Limits'!E34","v":"EN 1601"},{"$f":"'Methods&Limits'!F34","v":2017},{"$f":"'Methods&Limits'!G34","v":0.41},null,{"$f":"'Methods&Limits'!I34","v":3.9419},{"$f":"IF(E28>G87,\"Yes\",\"\")","v":""}]
[null,null,{"$f":"'Methods&Limits'!E35","v":"EN 1601"},{"$f":"'Methods&Limits'!F35","v":2017},{"$f":"'Methods&Limits'!G35","v":0.41},null,{"$f":"'Methods&Limits'!I35","v":2.9419},{"$f":"IF(E29>G88,\"Yes\",\"\")","v":""}]
[{"$f":"'Methods&Limits'!A36","v":"Oxygenates"}]
[{"$f":"'Methods&Limits'!A37","v":"-- Methanol"},{"$f":"'Methods&Limits'!B37","v":"% V/V"},{"$f":"'Methods&Limits'!E37","v":"EN 1601"},{"$f":"'Methods&Limits'!F37","v":2017},{"$f":"'Methods&Limits'!G37","v":0.3},null,{"$f":"'Methods&Limits'!I37","v":3.177},{"$f":"IF(E31>G90,\"Yes\",\"\")","v":""}]
[{"$f":"'Methods&Limits'!A38","v":"-- Ethanol"},{"$f":"'Methods&Limits'!B38","v":"% V/V"},{"$f":"'Methods&Limits'!E38","v":"EN 1601"},{"$f":"'Methods&Limits'!F38","v":2017},{"$f":"'Methods&Limits'!G38","v":0.8},null,{"$f":"'Methods&Limits'!I38","v":10.472},""]
[{"$f":"'Methods&Limits'!A39","v":"-- Iso-propyl alcohol"},{"$f":"'Methods&Limits'!B39","v":"% V/V"},{"$f":"'Methods&Limits'!E39","v":"EN 1601"},{"$f":"'Methods&Limits'!F39","v":2017},{"$f":"'Methods&Limits'!G39","v":0.9},null,{"$f":"'Methods&Limits'!I39","v":12.531000000000001},""]
[{"$f":"'Methods&Limits'!A40","v":"-- Tert-butyl alcohol"},{"$f":"'Methods&Limits'!B40","v":"% V/V"},{"$f":"'Methods&Limits'!E40","v":"EN 1601"},{"$f":"'Methods&Limits'!F40","v":2017},{"$f":"'Methods&Limits'!G40","v":1},null,{"$f":"'Methods&Limits'!I40","v":15.59},""]
[{"$f":"'Methods&Limits'!A41","v":"-- Iso-butyl alcohol"},{"$f":"'Methods&Limits'!B41","v":"% V/V"},{"$f":"'Methods&Limits'!E41","v":"EN 1601"},{"$f":"'Methods&Limits'!F41","v":2017},{"$f":"'Methods&Limits'!G41","v":1},null,{"$f":"'Methods&Limits'!I41","v":15.59},""]
[{"$f":"'Methods&Limits'!A42","v":"-- Ethers with 5 or more carbon atoms per molecule"},{"$f":"'Methods&Limits'!B42","v":"% V/V"},{"$f":"'Methods&Limits'!E42","v":"EN 1601"},{"$f":"'Methods&Limits'!F42","v":2017},{"$f":"'Methods&Limits'!G42","v":1},null,{"$f":"'Methods&Limits'!I42","v":22.59},""]
[{"$f":"'Methods&Limits'!A43","v":"-- other oxygenates"},{"$f":"'Methods&Limits'!B43","v":"% V/V"},{"$f":"'Methods&Limits'!E43","v":"EN 1601"},{"$f":"'Methods&Limits'!F43","v":2017},{"$f":"'Methods&Limits'!G43","v":1},null,{"$f":"'Methods&Limits'!I43","v":15.59},""]
[{"$f":"'Methods&Limits'!A44","v":"Oxygen content"},{"$f":"'Methods&Limits'!B44","v":"% (m/m)"},{"$f":"'Methods&Limits'!E44","v":"EN 13132"},{"$f":"'Methods&Limits'!F44","v":2002},{"$f":"'Methods&Limits'!G44","v":0.3},null,{"$f":"'Methods&Limits'!I44","v":3.8770000000000002},{"$f":"IF(E28>G97,\"Yes\",\"\")","v":""}]
[null,null,{"$f":"'Methods&Limits'!E45","v":"EN 13132"},{"$f":"'Methods&Limits'!F45","v":2002},{"$f":"'Methods&Limits'!G45","v":0.3},null,{"$f":"'Methods&Limits'!I45","v":2.8770000000000002},{"$f":"IF(E29>G98,\"Yes\",\"\")","v":""}]
[{"$f":"'Methods&Limits'!A46","v":"Oxygenates"}]
[{"$f":"'Methods&Limits'!A47","v":"-- Methanol"},{"$f":"'Methods&Limits'!B47","v":"% V/V"},{"$f":"'Methods&Limits'!E47","v":"EN 13132"},{"$f":"'Methods&Limits'!F47","v":2002},{"$f":"'Methods&Limits'!G47","v":0.3},null,{"$f":"'Methods&Limits'!I47","v":3.177},{"$f":"IF(E31>G100,\"Yes\",\"\")","v":""}]
[{"$f":"'Methods&Limits'!A48","v":"-- Ethanol"},{"$f":"'Methods&Limits'!B48","v":"% V/V"},{"$f":"'Methods&Limits'!E48","v":"EN 13132"},{"$f":"'Methods&Limits'!F48","v":2002},{"$f":"'Methods&Limits'!G48","v":0.8},null,{"$f":"'Methods&Limits'!I48","v":10.472},""]
[{"$f":"'Methods&Limits'!A49","v":"-- Iso-propyl alcohol"},{"$f":"'Methods&Limits'!B49","v":"% V/V"},{"$f":"'Methods&Limits'!E49","v":"EN 13132"},{"$f":"'Methods&Limits'!F49","v":2002},{"$f":"'Methods&Limits'!G49","v":0.8},null,{"$f":"'Methods&Limits'!I49","v":12.472},""]
[{"$f":"'Methods&Limits'!A50","v":"-- Tert-butyl alcohol"},{"$f":"'Methods&Limits'!B50","v":"% V/V"},{"$f":"'Methods&Limits'!E50","v":"EN 13132"},{"$f":"'Methods&Limits'!F50","v":2002},{"$f":"'Methods&Limits'!G50","v":1},null,{"$f":"'Methods&Limits'!I50","v":15.59},""]
[{"$f":"'Methods&Limits'!A51","v":"-- Iso-butyl alcohol"},{"$f":"'Methods&Limits'!B51","v":"% V/V"},{"$f":"'Methods&Limits'!E51","v":"EN 13132"},{"$f":"'Methods&Limits'!F51","v":2002},{"$f":"'Methods&Limits'!G51","v":1},null,{"$f":"'Methods&Limits'!I51","v":15.59},""]
[{"$f":"'Methods&Limits'!A52","v":"-- Ethers with 5 or more carbon atoms per molecule"},{"$f":"'Methods&Limits'!B52","v":"% V/V"},{"$f":"'Methods&Limits'!E52","v":"EN 13132"},{"$f":"'Methods&Limits'!F52","v":2002},{"$f":"'Methods&Limits'!G52","v":1},null,{"$f":"'Methods&Limits'!I52","v":22.59},""]
[{"$f":"'Methods&Limits'!A53","v":"-- other oxygenates"},{"$f":"'Methods&Limits'!B53","v":"% V/V"},{"$f":"'Methods&Limits'!E53","v":"EN 13132"},{"$f":"'Methods&Limits'!F53","v":2002},{"$f":"'Methods&Limits'!G53","v":1},null,{"$f":"'Methods&Limits'!I53","v":15.59},""]
[{"$f":"'Methods&Limits'!A54","v":"Oxygen content"},{"$f":"'Methods&Limits'!B54","v":"% (m/m)"},{"$f":"'Methods&Limits'!E54","v":"EN-ISO 22854"},{"$f":"'Methods&Limits'!F54","v":2021},{"$f":"'Methods&Limits'!G54","v":0.4},null,{"$f":"'Methods&Limits'!I54","v":3.9359999999999999},{"$f":"IF(E28>G107,\"Yes\",\"\")","v":""}]
[null,null,{"$f":"'Methods&Limits'!E55","v":"EN-ISO 22854"},{"$f":"'Methods&Limits'!F55","v":2021},{"$f":"'Methods&Limits'!G55","v":0.4},null,{"$f":"'Methods&Limits'!I55","v":2.9359999999999999},{"$f":"IF(E29>G108,\"Yes\",\"\")","v":""}]
[{"$f":"'Methods&Limits'!A56","v":"Oxyginates"}]
[{"$f":"'Methods&Limits'!A57","v":"-- Methanol"},{"$f":"'Methods&Limits'!B57","v":"% V/V"},{"$f":"'Methods&Limits'!E57","v":"EN-ISO 22854"},{"$f":"'Methods&Limits'!F57","v":2021},{"$f":"'Methods&Limits'!G57","v":0.4},null,{"$f":"'Methods&Limits'!I57","v":3.2359999999999998},{"$f":"IF(E31>G110,\"Yes\",\"\")","v":""}]
[{"$f":"'Methods&Limits'!A58","v":"-- Ethanol"},{"$f":"'Methods&Limits'!B58","v":"% V/V"},{"$f":"'Methods&Limits'!E58","v":"EN-ISO 22854"},{"$f":"'Methods&Limits'!F58","v":2021},{"$f":"'Methods&Limits'!G58","v":0.6},null,{"$f":"'Methods&Limits'!I58","v":10.353999999999999},""]
[{"$f":"'Methods&Limits'!A59","v":"-- Iso-propyl alcohol"},{"$f":"'Methods&Limits'!B59","v":"% V/V"},{"$f":"'Methods&Limits'!E59","v":"EN-ISO 22854"},{"$f":"'Methods&Limits'!F59","v":2021},{"$f":"'Methods&Limits'!G59","v":0.7},null,{"$f":"'Methods&Limits'!I59","v":12.413},""]
[{"$f":"'Methods&Limits'!A60","v":"-- Tert-butyl alcohol"},{"$f":"'Methods&Limits'!B60","v":"% V/V"},{"$f":"'Methods&Limits'!E60","v":"EN-ISO 22854"},{"$f":"'Methods&Limits'!F60","v":2021},{"$f":"'Methods&Limits'!G60","v":0.7},null,{"$f":"'Methods&Limits'!I60","v":15.413},""]
[{"$f":"'Methods&Limits'!A61","v":"-- Iso-butyl alcohol"},{"$f":"'Methods&Limits'!B61","v":"% V/V"},{"$f":"'Methods&Limits'!E61","v":"EN-ISO 22854"},{"$f":"'Methods&Limits'!F61","v":2021},{"$f":"'Methods&Limits'!G61","v":0.7},null,{"$f":"'Methods&Limits'!I61","v":15.413},""]
[{"$f":"'Methods&Limits'!A62","v":"-- Ethers with 5 or more carbon atoms per molecule"},{"$f":"'Methods&Limits'!B62","v":"% V/V"},{"$f":"'Methods&Limits'!E62","v":"EN-ISO 22854"},{"$f":"'Methods&Limits'!F62","v":2021},{"$f":"'Methods&Limits'!G62","v":0.9},null,{"$f":"'Methods&Limits'!I62","v":22.530999999999999},""]
[{"$f":"'Methods&Limits'!A63","v":"-- other oxygenates"},{"$f":"'Methods&Limits'!B63","v":"% V/V"},{"$f":"'Methods&Limits'!E63","v":"EN-ISO 22854"},{"$f":"'Methods&Limits'!F63","v":2021},{"$f":"'Methods&Limits'!G63","v":0.7},null,{"$f":"'Methods&Limits'!I63","v":15.413},""]
[{"$f":"'Methods&Limits'!A64:A64","v":"Sulphur content (sulphur free, from 2005)**"},{"$f":"'Methods&Limits'!B64","v":"mg/kg"},{"$f":"'Methods&Limits'!E64","v":"EN-ISO 14596"},{"$f":"'Methods&Limits'!F64","v":2018},{"$f":"'Methods&Limits'!G64","v":5},null,{"$f":"'Methods&Limits'!I64","v":12.95},{"$f":"IF(E$38>G117,\"Yes\",\"\")","v":""}]
[null,null,{"$f":"'Methods&Limits'!E65","v":"EN 24260"},{"$f":"'Methods&Limits'!F65","v":1994},{"$f":"'Methods&Limits'!G65","v":1},null,{"$f":"'Methods&Limits'!I65","v":10.59},{"$f":"IF(E$38>G118,\"Yes\",\"\")","v":""}]
[null,null,{"$f":"'Methods&Limits'!E66","v":"EN-ISO 20846"},{"$f":"'Methods&Limits'!F66","v":2019},{"$f":"'Methods&Limits'!G66","v":2.7},null,{"$f":"'Methods&Limits'!I66","v":11.593},{"$f":"IF(E$38>G119,\"Yes\",\"\")","v":""}]
[null,null,{"$f":"'Methods&Limits'!E67","v":"EN-ISO 20884"},{"$f":"'Methods&Limits'!F67","v":2019},{"$f":"'Methods&Limits'!G67","v":3.1},null,{"$f":"'Methods&Limits'!I67","v":11.829000000000001},{"$f":"IF(E$38>G120,\"Yes\",\"\")","v":""}]
[{"$f":"'Methods&Limits'!A68:A68","v":"Lead content"},{"$f":"'Methods&Limits'!B68","v":"g/l"},{"$f":"'Methods&Limits'!E68","v":"EN 237"},{"$f":"'Methods&Limits'!F68","v":2004},{"$f":"'Methods&Limits'!G68","v":6.1999999999999998E-3},null,{"$f":"'Methods&Limits'!I68","v":8.657999999999999E-3},{"$f":"IF($E$39>G121,\"Yes\",\"\")","v":""}]

{"sheet":"Petrol (5+6)","index":21,"n_rows":121,"n_cols":18,"rows_kept":121,"cut":false,"hidden":false,"merged":[[2,1,2,4],[2,6,9,16],[3,1,3,4],[4,1,4,4],[5,1,5,4],[6,1,6,4],[7,2,7,4],[13,2,14,10],[13,11,13,14],[13,15,13,16],[14,11,14,12],[14,13,14,14],[14,15,14,16],[58,2,58,8],[58,9,58,12],[20,15,22,15],[27,15,28,15],[27,16,28,16],[43,0,43,3],[44,4,45,11],[46,4,46,11],[47,4,47,11],[48,4,48,11],[49,4,49,11],[50,4,50,11],[53,0,53,11],[71,11,71,12],[59,5,59,6],[59,9,60,9],[61,11,61,12],[62,11,62,12],[63,11,63,12],[64,11,64,12],[66,11,66,12],[67,11,67,12],[68,11,68,12],[69,11,69,12],[70,11,70,12],[59,11,59,12],[85,11,85,12],[72,11,72,12],[74,11,74,12],[75,11,75,12],[77,11,77,12],[78,11,78,12],[79,11,79,12],[80,11,80,12],[81,11,81,12],[82,11,82,12],[83,11,83,12],[84,11,84,12],[99,11,99,12],[86,11,86,12],[87,11,87,12],[89,11,89,12],[90,11,90,12],[91,11,91,12],[92,11,92,12],[93,11,93,12],[94,11,94,12],[95,11,95,12],[96,11,96,12],[97,11,97,12],[112,11,112,12],[100,11,100,12],[101,11,101,12],[102,11,102,12],[103,11,103,12],[104,11,104,12],[105,11,105,12],[106,11,106,12],[107,11,107,12],[109,11,109,12],[110,11,110,12],[111,11,111,12],[119,11,119,12],[120,11,120,12],[121,11,121,12],[122,11,122,12],[113,11,113,12],[114,11,114,12],[115,11,115,12],[116,11,116,12],[117,11,117,12],[118,11,118,12]]}
["Market Fuels used in Vehicles with Spark Ignition Engines (Petrol)",null,null,null,null,null,null,null,null,null,null,null,null,null,null,null,null,"<-- GO BACK"]
[]
["Country",{"$f":"IF(LEN('Contacts&Annual Summary'!C9) > 1,'Contacts&Annual Summary'!C9,\"\")","v":""},null,null,null,null,"Notes on completing the tables\nThe table structure has been locked to prevent modification - data can be copied and pasted, in bulk into the Reporting Results blue table cells.  Where a white row exists between rows, it will not be possible to paste over white rows and sections should be pasted separately.\n\nColumn H in the Test Methods and Analysis table is set to automatically check whether the values entered in the Reporting Results table exceed maximum or minimum Tolerance Limits.  If any exceedance is detected, please provide details in the columns to the right including the number of samples, location samples were taken from, Values and Details of any action taken to address non-compliant samples.  Compliance information is verified manually and this automated compliance check is not solely relied upon during data analysis.\n\nPlease do not unlock this template - modified templates cannot be processed and may delay reporting."]
["Reporting Year",{"$f":"'Contacts&Annual Summary'!C8","v":2023}]
["Period (Summer or Winter)","Full Year"]
["Parent fuel grade","Petrol"]
["National fuel grade",{"$f":"'Petrol (5)'!B7","v":0}]
["Summer Period (N or A)*",0,{"$f":"IF( B8=\"A\",\"1st June to 31st August (arctic)\",\"1st May to 30th September (normal)\")","v":"1st May to 30th September (normal)"}]
["The maximum bioethanol content (% v/v)",{"$f":"MAX('Petrol (5)'!B9,'Petrol (6)'!B9)","v":0},"Please include the bioethanol content as a numerical figure in % V/V"]
["* N = 1st May to 30th September (normal) ; A = 1st June to 31st August (arctic)."]
[]
["Reporting results"]
[]
["Parameter","Unit","Analytical and statistical results \n(Please see an explanation and examples for new columns/ information required in Cells I15 to K37 on the Introduction & Instructions tab).",null,null,null,null,null,null,null,null,"Limiting Value (1)",null,null,null,"Test method"]
[null,null,null,null,null,null,null,null,null,null,null,"National Specification, if any",null,"According to Directive 2009/30/EC",null,"(more recent versions may also be used)"]
[null,null,"No Samples","Minimum","Maximum","Median","Mean","Standard Deviation","No Samples outside 95% tolerance limit","25% of Sample Value","75% of Sample Value","Minimum","Maximum","Minimum","Maximum","Method","Date"]
["Research Octane Number","--",{"$f":"IF(AND('Petrol (5)'!C17=\"\",'Petrol (6)'!C17=\"\"),\"\",'Petrol (5)'!C17+'Petrol (6)'!C17)","v":0},{"$f":"IF(AND('Petrol (5)'!D17=\"\",'Petrol (6)'!D17=\"\"),\"\",MIN('Petrol (5)'!D17,'Petrol (6)'!D17))","v":0},{"$f":"IF(AND('Petrol (5)'!E17=\"\",'Petrol (6)'!E17=\"\"),\"\",MAX('Petrol (5)'!E17,'Petrol (6)'!E17))","v":0},0,0,0,{"$f":"IF(AND('Petrol (5)'!I17=\"\",'Petrol (6)'!I17=\"\"),\"\",'Petrol (5)'!I17+'Petrol (6)'!I17)","v":0},0,0,null,null,"95 (2)",null,"EN-ISO 5164",2005]
["Motor Octane Number","--",{"$f":"IF(AND('Petrol (5)'!C18=\"\",'Petrol (6)'!C18=\"\"),\"\",'Petrol (5)'!C18+'Petrol (6)'!C18)","v":0},{"$f":"IF(AND('Petrol (5)'!D18=\"\",'Petrol (6)'!D18=\"\"),\"\",MIN('Petrol (5)'!D18,'Petrol (6)'!D18))","v":0},{"$f":"IF(AND('Petrol (5)'!E18=\"\",'Petrol (6)'!E18=\"\"),\"\",MAX('Petrol (5)'!E18,'Petrol (6)'!E18))","v":0},0,0,0,{"$f":"IF(AND('Petrol (5)'!I18=\"\",'Petrol (6)'!I18=\"\"),\"\",'Petrol (5)'!I18+'Petrol (6)'!I18)","v":0},0,0,null,null,"85 (3)",null,"EN-ISO 5163",2005]
["Vapour Pressure, DVPE (6)","kPa",null,null,null,null,null,null,null,null,null,null,null,null,"(4)"]
["-- required for summer period only",null,{"$f":"IF(AND('Petrol (5)'!C20=\"\",'Petrol (6)'!C20=\"\"),\"\",'Petrol (5)'!C20+'Petrol (6)'!C20)","v":0},{"$f":"IF(AND('Petrol (5)'!D20=\"\",'Petrol (6)'!D20=\"\"),\"\",MIN('Petrol (5)'!D20,'Petrol (6)'!D20))","v":0},{"$f":"IF(AND('Petrol (5)'!E20=\"\",'Petrol (6)'!E20=\"\"),\"\",MAX('Petrol (5)'!E20,'Petrol (6)'!E20))","v":0},0,0,0,{"$f":"IF(AND('Petrol (5)'!I20=\"\",'Petrol (6)'!I20=\"\"),\"\",'Petrol (5)'!I20+'Petrol (6)'!I20)","v":0},0,0,null,null,null,{"$f":"IF(E8=\"A\",70,60)","v":60},"EN 13106-1",2007]
["Distillation",null,null,null,null,null,null,null,null,null,null,null,null,null,null,"EN-ISO 3405"]
["-- evaporated at 100 oC","% V/V",{"$f":"IF(AND('Petrol (5)'!C22=\"\",'Petrol (6)'!C22=\"\"),\"\",'Petrol (5)'!C22+'Petrol (6)'!C22)","v":0},{"$f":"IF(AND('Petrol (5)'!D22=\"\",'Petrol (6)'!D22=\"\"),\"\",MIN('Petrol (5)'!D22,'Petrol (6)'!D22))","v":0},{"$f":"IF(AND('Petrol (5)'!E22=\"\",'Petrol (6)'!E22=\"\"),\"\",MAX('Petrol (5)'!E22,'Petrol (6)'!E22))","v":0},0,0,0,{"$f":"IF(AND('Petrol (5)'!I22=\"\",'Petrol (6)'!I22=\"\"),\"\",'Petrol (5)'!I22+'Petrol (6)'!I22)","v":0},0,0,null,null,46,null,null,2000]
["-- evaporated at 150 oC ","% V/V",{"$f":"IF(AND('Petrol (5)'!C23=\"\",'Petrol (6)'!C23=\"\"),\"\",'Petrol (5)'!C23+'Petrol (6)'!C23)","v":0},{"$f":"IF(AND('Petrol (5)'!D23=\"\",'Petrol (6)'!D23=\"\"),\"\",MIN('Petrol (5)'!D23,'Petrol (6)'!D23))","v":0},{"$f":"IF(AND('Petrol (5)'!E23=\"\",'Petrol (6)'!E23=\"\"),\"\",MAX('Petrol (5)'!E23,'Petrol (6)'!E23))","v":0},0,0,0,{"$f":"IF(AND('Petrol (5)'!I23=\"\",'Petrol (6)'!I23=\"\"),\"\",'Petrol (5)'!I23+'Petrol (6)'!I23)","v":0},0,0,null,null,75]
["Hydrocarbon analysis"]
["-- Olefins","% V/V",{"$f":"IF(AND('Petrol (5)'!C25=\"\",'Petrol (6)'!C25=\"\"),\"\",'Petrol (5)'!C25+'Petrol (6)'!C25)","v":0},{"$f":"IF(AND('Petrol (5)'!D25=\"\",'Petrol (6)'!D25=\"\"),\"\",MIN('Petrol (5)'!D25,'Petrol (6)'!D25))","v":0},{"$f":"IF(AND('Petrol (5)'!E25=\"\",'Petrol (6)'!E25=\"\"),\"\",MAX('Petrol (5)'!E25,'Petrol (6)'!E25))","v":0},0,0,0,{"$f":"IF(AND('Petrol (5)'!I25=\"\",'Petrol (6)'!I25=\"\"),\"\",'Petrol (5)'!I25+'Petrol (6)'!I25)","v":0},0,0,null,null,null,"18.0 (5)","ASTM D 1319\nEN 15553\nEN-ISO 22854","1995\n2007\n2008"]
["-- Aromatics","% V/V",{"$f":"IF(AND('Petrol (5)'!C26=\"\",'Petrol (6)'!C26=\"\"),\"\",'Petrol (5)'!C26+'Petrol (6)'!C26)","v":0},{"$f":"IF(AND('Petrol (5)'!D26=\"\",'Petrol (6)'!D26=\"\"),\"\",MIN('Petrol (5)'!D26,'Petrol (6)'!D26))","v":0},{"$f":"IF(AND('Petrol (5)'!E26=\"\",'Petrol (6)'!E26=\"\"),\"\",MAX('Petrol (5)'!E26,'Petrol (6)'!E26))","v":0},0,0,0,{"$f":"IF(AND('Petrol (5)'!I26=\"\",'Petrol (6)'!I26=\"\"),\"\",'Petrol (5)'!I26+'Petrol (6)'!I26)","v":0},0,0,null,null,null,35,"EN-ISO 22854","1995\n2008"]
["-- Benzene","% V/V",{"$f":"IF(AND('Petrol (5)'!C27=\"\",'Petrol (6)'!C27=\"\"),\"\",'Petrol (5)'!C27+'Petrol (6)'!C27)","v":0},{"$f":"IF(AND('Petrol (5)'!D27=\"\",'Petrol (6)'!D27=\"\"),\"\",MIN('Petrol (5)'!D27,'Petrol (6)'!D27))","v":0},{"$f":"IF(AND('Petrol (5)'!E27=\"\",'Petrol (6)'!E27=\"\"),\"\",MAX('Petrol (5)'!E27,'Petrol (6)'!E27))","v":0},0,0,0,{"$f":"IF(AND('Petrol (5)'!I27=\"\",'Petrol (6)'!I27=\"\"),\"\",'Petrol (5)'!I27+'Petrol (6)'!I27)","v":0},0,0,null,null,null,1,"EN 238\nEN 12177\nEN-ISO 22854","1996\n1998\n2008"]
[{"$f":"IF(C29>0,\"Do not complete\",\"Oxygen content\")","v":"Oxygen content"},"% (m/m)",{"$f":"IF(AND('Petrol (5)'!C28=\"\",'Petrol (6)'!C28=\"\"),\"\",'Petrol (5)'!C28+'Petrol (6)'!C28)","v":0},{"$f":"IF(AND('Petrol (5)'!D28=\"\",'Petrol (6)'!D28=\"\"),\"\",MIN('Petrol (5)'!D28,'Petrol (6)'!D28))","v":0},{"$f":"IF(AND('Petrol (5)'!E28=\"\",'Petrol (6)'!E28=\"\"),\"\",MAX('Petrol (5)'!E28,'Petrol (6)'!E28))","v":0},0,0,0,{"$f":"IF(AND('Petrol (5)'!I28=\"\",'Petrol (6)'!I28=\"\"),\"\",'Petrol (5)'!I28+'Petrol (6)'!I28)","v":0},0,0,null,null,null,3.7,"EN 1601\nEN 13132\nEN-ISO 22854","1997\n2000\n2008"]
[{"$f":"IF(C28>0,\"Do not complete\",\"Oxygen content*\n*petrol with 5% (v/v) or less ethanol content\")","v":"Oxygen content*\n*petrol with 5% (v/v) or less ethanol content"},"% (m/m)",{"$f":"IF(AND('Petrol (5)'!C29=\"\",'Petrol (6)'!C29=\"\"),\"\",'Petrol (5)'!C29+'Petrol (6)'!C29)","v":0},{"$f":"IF(AND('Petrol (5)'!D29=\"\",'Petrol (6)'!D29=\"\"),\"\",MIN('Petrol (5)'!D29,'Petrol (6)'!D29))","v":0},{"$f":"IF(AND('Petrol (5)'!E29=\"\",'Petrol (6)'!E29=\"\"),\"\",MAX('Petrol (5)'!E29,'Petrol (6)'!E29))","v":0},0,0,0,{"$f":"IF(AND('Petrol (5)'!I29=\"\",'Petrol (6)'!I29=\"\"),\"\",'Petrol (5)'!I29+'Petrol (6)'!I29)","v":0},0,0,null,null,null,2.7]
["Oxygenates"]
["-- Methanol","% V/V",{"$f":"IF(AND('Petrol (5)'!C31=\"\",'Petrol (6)'!C31=\"\"),\"\",'Petrol (5)'!C31+'Petrol (6)'!C31)","v":0},{"$f":"IF(AND('Petrol (5)'!D31=\"\",'Petrol (6)'!D31=\"\"),\"\",MIN('Petrol (5)'!D31,'Petrol (6)'!D31))","v":0},{"$f":"IF(AND('Petrol (5)'!E31=\"\",'Petrol (6)'!E31=\"\"),\"\",MAX('Petrol (5)'!E31,'Petrol (6)'!E31))","v":0},0,0,0,{"$f":"IF(AND('Petrol (5)'!I31=\"\",'Petrol (6)'!I31=\"\"),\"\",'Petrol (5)'!I31+'Petrol (6)'!I31)","v":0},0,0,null,null,null,3]
["-- Ethanol","% V/V",{"$f":"IF(AND('Petrol (5)'!C32=\"\",'Petrol (6)'!C32=\"\"),\"\",'Petrol (5)'!C32+'Petrol (6)'!C32)","v":0},{"$f":"IF(AND('Petrol (5)'!D32=\"\",'Petrol (6)'!D32=\"\"),\"\",MIN('Petrol (5)'!D32,'Petrol (6)'!D32))","v":0},{"$f":"IF(AND('Petrol (5)'!E32=\"\",'Petrol (6)'!E32=\"\"),\"\",MAX('Petrol (5)'!E32,'Petrol (6)'!E32))","v":0},0,0,0,{"$f":"IF(AND('Petrol (5)'!I32=\"\",'Petrol (6)'!I32=\"\"),\"\",'Petrol (5)'!I32+'Petrol (6)'!I32)","v":0},0,0,null,null,null,10]
["-- Iso-propyl alcohol","% V/V",{"$f":"IF(AND('Petrol (5)'!C33=\"\",'Petrol (6)'!C33=\"\"),\"\",'Petrol (5)'!C33+'Petrol (6)'!C33)","v":0},{"$f":"IF(AND('Petrol (5)'!D33=\"\",'Petrol (6)'!D33=\"\"),\"\",MIN('Petrol (5)'!D33,'Petrol (6)'!D33))","v":0},{"$f":"IF(AND('Petrol (5)'!E33=\"\",'Petrol (6)'!E33=\"\"),\"\",MAX('Petrol (5)'!E33,'Petrol (6)'!E33))","v":0},0,0,0,{"$f":"IF(AND('Petrol (5)'!I33=\"\",'Petrol (6)'!I33=\"\"),\"\",'Petrol (5)'!I33+'Petrol (6)'!I33)","v":0},0,0,null,null,null,12,"EN 1601",1997]
["-- Tert-butyl alcohol","% V/V",{"$f":"IF(AND('Petrol (5)'!C34=\"\",'Petrol (6)'!C34=\"\"),\"\",'Petrol (5)'!C34+'Petrol (6)'!C34)","v":0},{"$f":"IF(AND('Petrol (5)'!D34=\"\",'Petrol (6)'!D34=\"\"),\"\",MIN('Petrol (5)'!D34,'Petrol (6)'!D34))","v":0},{"$f":"IF(AND('Petrol (5)'!E34=\"\",'Petrol (6)'!E34=\"\"),\"\",MAX('Petrol (5)'!E34,'Petrol (6)'!E34))","v":0},0,0,0,{"$f":"IF(AND('Petrol (5)'!I34=\"\",'Petrol (6)'!I34=\"\"),\"\",'Petrol (5)'!I34+'Petrol (6)'!I34)","v":0},0,0,null,null,null,15,"EN 13132",2000]
["-- Iso-butyl alcohol","% V/V",{"$f":"IF(AND('Petrol (5)'!C35=\"\",'Petrol (6)'!C35=\"\"),\"\",'Petrol (5)'!C35+'Petrol (6)'!C35)","v":0},{"$f":"IF(AND('Petrol (5)'!D35=\"\",'Petrol (6)'!D35=\"\"),\"\",MIN('Petrol (5)'!D35,'Petrol (6)'!D35))","v":0},{"$f":"IF(AND('Petrol (5)'!E35=\"\",'Petrol (6)'!E35=\"\"),\"\",MAX('Petrol (5)'!E35,'Petrol (6)'!E35))","v":0},0,0,0,{"$f":"IF(AND('Petrol (5)'!I35=\"\",'Petrol (6)'!I35=\"\"),\"\",'Petrol (5)'!I35+'Petrol (6)'!I35)","v":0},0,0,null,null,null,15,"EN-ISO 22854",2008]
["-- Ethers with ≥5 carbon atoms / molecule","% V/V",{"$f":"IF(AND('Petrol (5)'!C36=\"\",'Petrol (6)'!C36=\"\"),\"\",'Petrol (5)'!C36+'Petrol (6)'!C36)","v":0},{"$f":"IF(AND('Petrol (5)'!D36=\"\",'Petrol (6)'!D36=\"\"),\"\",MIN('Petrol (5)'!D36,'Petrol (6)'!D36))","v":0},{"$f":"IF(AND('Petrol (5)'!E36=\"\",'Petrol (6)'!E36=\"\"),\"\",MAX('Petrol (5)'!E36,'Petrol (6)'!E36))","v":0},0,0,0,{"$f":"IF(AND('Petrol (5)'!I36=\"\",'Petrol (6)'!I36=\"\"),\"\",'Petrol (5)'!I36+'Petrol (6)'!I36)","v":0},0,0,null,null,null,22]
["-- other oxygenates","% V/V",{"$f":"IF(AND('Petrol (5)'!C37=\"\",'Petrol (6)'!C37=\"\"),\"\",'Petrol (5)'!C37+'Petrol (6)'!C37)","v":0},{"$f":"IF(AND('Petrol (5)'!D37=\"\",'Petrol (6)'!D37=\"\"),\"\",MIN('Petrol (5)'!D37,'Petrol (6)'!D37))","v":0},{"$f":"IF(AND('Petrol (5)'!E37=\"\",'Petrol (6)'!E37=\"\"),\"\",MAX('Petrol (5)'!E37,'Petrol (6)'!E37))","v":0},0,0,0,{"$f":"IF(AND('Petrol (5)'!I37=\"\",'Petrol (6)'!I37=\"\"),\"\",'Petrol (5)'!I37+'Petrol (6)'!I37)","v":0},0,0,null,null,null,15]
["Sulphur content","mg/kg",{"$f":"IF(AND('Petrol (5)'!C38=\"\",'Petrol (6)'!C38=\"\"),\"\",'Petrol (5)'!C38+'Petrol (6)'!C38)","v":0},{"$f":"IF(AND('Petrol (5)'!D38=\"\",'Petrol (6)'!D38=\"\"),\"\",MIN('Petrol (5)'!D38,'Petrol (6)'!D38))","v":0},{"$f":"IF(AND('Petrol (5)'!E38=\"\",'Petrol (6)'!E38=\"\"),\"\",MAX('Petrol (5)'!E38,'Petrol (6)'!E38))","v":0},0,0,0,{"$f":"IF(AND('Petrol (5)'!I38=\"\",'Petrol (6)'!I38=\"\"),\"\",'Petrol (5)'!I38+'Petrol (6)'!I38)","v":0},0,0,null,null,null,10,"EN-ISO 14596\nEN 24260\nEN-ISO 20846\nEN-ISO 20884","1998\n1994\n2004\n2004"]
["Lead content","g/l",{"$f":"IF(AND('Petrol (5)'!C39=\"\",'Petrol (6)'!C39=\"\"),\"\",'Petrol (5)'!C39+'Petrol (6)'!C39)","v":0},{"$f":"IF(AND('Petrol (5)'!D39=\"\",'Petrol (6)'!D39=\"\"),\"\",MIN('Petrol (5)'!D39,'Petrol (6)'!D39))","v":0},{"$f":"IF(AND('Petrol (5)'!E39=\"\",'Petrol (6)'!E39=\"\"),\"\",MAX('Petrol (5)'!E39,'Petrol (6)'!E39))","v":0},0,0,0,{"$f":"IF(AND('Petrol (5)'!I39=\"\",'Petrol (6)'!I39=\"\"),\"\",'Petrol (5)'!I39+'Petrol (6)'!I39)","v":0},0,0,null,null,null,5.0000000000000001E-3,"EN 237",1996]
[]
[]
["Sampling frequency"]
[]
["Number of samples in month"]
["January",{"$f":"'Petrol (5)'!B45+'Petrol (6)'!B45","v":0},"July",{"$f":"'Petrol (5)'!D45+'Petrol (6)'!D45","v":0},"(1) The limiting values are \"true values\" and were established according to the procedures for limit setting in EN 228:2008  The results of individual measurements shall be interpreted following the criteria described in EN 228:2008."]
["February",{"$f":"'Petrol (5)'!B46+'Petrol (6)'!B46","v":0},"August",{"$f":"'Petrol (5)'!D46+'Petrol (6)'!D46","v":0}]
["March",{"$f":"'Petrol (5)'!B47+'Petrol (6)'!B47","v":0},"September",{"$f":"'Petrol (5)'!D47+'Petrol (6)'!D47","v":0},"(2) 91 for unleaded regular grade petrol: See 2009/30/EC Annex I, Footnote 3."]
["April",{"$f":"'Petrol (5)'!B48+'Petrol (6)'!B48","v":0},"October",{"$f":"'Petrol (5)'!D48+'Petrol (6)'!D48","v":0},"(3) 81 for unleaded regular grade petrol: See 2009/30/EC Annex I, Footnote 3."]
["May",{"$f":"'Petrol (5)'!B49+'Petrol (6)'!B49","v":0},"November",{"$f":"'Petrol (5)'!D49+'Petrol (6)'!D49","v":0},"(4) 70 kPa for Member States with arctic or severe weather conditions: See 2003/30/EC Annex I, Footnotes 4 & 5."]
["June",{"$f":"'Petrol (5)'!B50+'Petrol (6)'!B50","v":0},"December",{"$f":"'Petrol (5)'!D50+'Petrol (6)'!D50","v":0},"(5) 21 for unleaded regular grade petrol: See 98/70/EC, Annex I, Footnote 6."]
[null,null,"Full YearTotal",{"$f":"SUM(B45:B50,D45:D50)","v":0},"(6) Vapour pressure waiver applies for petrol containing Bioethanol, see 2009/30/EC Annex I, Footnote 5 and Annex III."]
[]
["Other notes (optional):"]
[]
[]
[]
["Test Methods and Analysis",null,null,null,null,null,null,null,"Only if not provided in Summer and Winter sheets"]
[]
["Parameter","Unit","Test specified in 2009/30/EC or EN228:2008",null,null,null,null,null,null,"Notes on exceedences"]
[null,null,"Method","Date","Reproducability, R","Tolerance limits",null,null,null,"Sample location (S,T or R)","Values","Details/action taken"]
[null,null,null,null,null,"Minimum","Maximum","Exceeded?"]
[{"$f":"'Methods&Limits'!A9","v":"Research Octane Number (RON)"},{"$f":"'Methods&Limits'!B9","v":"--"},{"$f":"'Methods&Limits'!E9","v":"EN-ISO 5164"},{"$f":"'Methods&Limits'!F9","v":2014},{"$f":"'Methods&Limits'!G9","v":0.7},{"$f":"'Methods&Limits'!H9","v":94.587000000000003},null,{"$f":"IF(D17=\"\",\"\",IF(D17<F62,\"Yes\",\"\"))","v":"Yes"}]
[{"$f":"'Methods&Limits'!A10","v":"(RON 91 fuel only)"},{"$f":"'Methods&Limits'!B10","v":"--"},{"$f":"'Methods&Limits'!E10","v":"EN-ISO 5164"},{"$f":"'Methods&Limits'!F10","v":2014},{"$f":"'Methods&Limits'!G10","v":0.7},{"$f":"'Methods&Limits'!H10","v":90.587000000000003},null,{"$f":"IF(D17=\"\",\"\",IF(D17<F63,\"Yes\",\"\"))","v":"Yes"}]
[{"$f":"'Methods&Limits'!A11","v":"Motor Octane Number (MON)"},{"$f":"'Methods&Limits'!B11","v":"--"},{"$f":"'Methods&Limits'!E11","v":"EN-ISO 5163"},{"$f":"'Methods&Limits'!F11","v":2014},{"$f":"'Methods&Limits'!G11","v":0.9},{"$f":"'Methods&Limits'!H11","v":84.468999999999994},null,{"$f":"IF(D18=\"\",\"\",IF(D18<F64,\"Yes\",\"\"))","v":"Yes"}]
[{"$f":"'Methods&Limits'!A12","v":"(RON 91 fuel only)"},{"$f":"'Methods&Limits'!B12","v":"--"},{"$f":"'Methods&Limits'!E12","v":"EN-ISO 5163"},{"$f":"'Methods&Limits'!F12","v":2014},{"$f":"'Methods&Limits'!G12","v":0.9},{"$f":"'Methods&Limits'!H12","v":80.468999999999994},null,{"$f":"IF(D18=\"\",\"\",IF(D18<F65,\"Yes\",\"\"))","v":"Yes"}]
[{"$f":"'Methods&Limits'!A13","v":"Vapour Pressure, DVPE"}]
[{"$f":"'Methods&Limits'!A14","v":"--summer period (normal)"},{"$f":"'Methods&Limits'!B14","v":"kPa"},{"$f":"'Methods&Limits'!E14","v":"EN 13016-1"},{"$f":"'Methods&Limits'!F14","v":2018},{"$f":"'Methods&Limits'!G14","v":2.2000000000000002},null,{"$f":"'Methods&Limits'!I14","v":61.298000000000002},{"$f":"IF(E$20=\"\",\"\",IF(E$20>G67,\"Yes\",\"\"))","v":""}]
[{"$f":"'Methods&Limits'!A15","v":"-- Petrol with bioethanol content 0-2"},{"$f":"'Methods&Limits'!B15","v":"kPa"},{"$f":"'Methods&Limits'!E15","v":"EN 1601"},{"$f":"'Methods&Limits'!F15","v":2017},{"$f":"'Methods&Limits'!G15","v":2.2999999999999998},null,{"$f":"'Methods&Limits'!I15","v":67.307000000000002},{"$f":"IF(E$20=\"\",\"\",IF(E$20>G68,\"Yes\",\"\"))","v":""}]
[{"$f":"'Methods&Limits'!A16","v":"-- Petrol with bioethanol content 2-4"},{"$f":"'Methods&Limits'!B16","v":"kPa"},{"$f":"'Methods&Limits'!E16","v":"EN 1601"},{"$f":"'Methods&Limits'!F16","v":2017},{"$f":"'Methods&Limits'!G16","v":2.2999999999999998},null,{"$f":"'Methods&Limits'!I16","v":69.156999999999996},""]
[{"$f":"'Methods&Limits'!A17","v":"-- Petrol with bioethanol content 4-6"},{"$f":"'Methods&Limits'!B17","v":"kPa"},{"$f":"'Methods&Limits'!E17","v":"EN 1601"},{"$f":"'Methods&Limits'!F17","v":2017},{"$f":"'Methods&Limits'!G17","v":2.2999999999999998},null,{"$f":"'Methods&Limits'!I17","v":69.356999999999999},""]
[{"$f":"'Methods&Limits'!A18","v":"-- Petrol with bioethanol content 6-8"},{"$f":"'Methods&Limits'!B18","v":"kPa"},{"$f":"'Methods&Limits'!E18","v":"EN 1601"},{"$f":"'Methods&Limits'!F18","v":2017},{"$f":"'Methods&Limits'!G18","v":2.2999999999999998},null,{"$f":"'Methods&Limits'!I18","v":69.236999999999995},""]
[{"$f":"'Methods&Limits'!A19","v":"-- Petrol with bioethanol content 8-10"},{"$f":"'Methods&Limits'!B19","v":"kPa"},{"$f":"'Methods&Limits'!E19","v":"EN 1601"},{"$f":"'Methods&Limits'!F19","v":2017},{"$f":"'Methods&Limits'!G19","v":2.2999999999999998},null,{"$f":"'Methods&Limits'!I19","v":69.117000000000004},""]
[{"$f":"'Methods&Limits'!A20","v":"--summer period (arctic or severe weather conditions)"},{"$f":"'Methods&Limits'!B20","v":"kPa"},{"$f":"'Methods&Limits'!E20","v":"EN 13016-1"},{"$f":"'Methods&Limits'!F20","v":2018},{"$f":"'Methods&Limits'!G20","v":2.2999999999999998},null,{"$f":"'Methods&Limits'!I20","v":71.356999999999999},""]
[{"$f":"'Methods&Limits'!A21","v":"Distillation *"}]
[{"$f":"'Methods&Limits'!A22","v":"--evaporated at 100 oC"},{"$f":"'Methods&Limits'!B22","v":"% V/V"},{"$f":"'Methods&Limits'!E22","v":"EN-ISO 3405"},{"$f":"'Methods&Limits'!F22","v":2020},{"$f":"'Methods&Limits'!G22","v":4},{"$f":"'Methods&Limits'!H22","v":43.64},null,{"$f":"IF(D22=\"\",\"\",IF(D22<F75,\"Yes\",\"\"))","v":"Yes"}]
[{"$f":"'Methods&Limits'!A23","v":"-- evaporated at 150 oC "},{"$f":"'Methods&Limits'!B23","v":"% V/V"},{"$f":"'Methods&Limits'!E23","v":"EN-ISO 3405"},{"$f":"'Methods&Limits'!F23","v":2020},{"$f":"'Methods&Limits'!G23","v":4},{"$f":"'Methods&Limits'!H23","v":72.64},null,{"$f":"IF(D23=\"\",\"\",IF(D23<F76,\"Yes\",\"\"))","v":"Yes"}]
[{"$f":"'Methods&Limits'!A24","v":"Hydrocarbon analysis"},null,null,null,null,null,null,{"$f":"IF(D24<F77,\"Yes\",\"\")","v":""}]
[{"$f":"'Methods&Limits'!A25","v":"-- Olefins"},{"$f":"'Methods&Limits'!B25","v":"% V/V"},{"$f":"'Methods&Limits'!E25","v":"EN 15553"},{"$f":"'Methods&Limits'!F25","v":2021},{"$f":"'Methods&Limits'!G25","v":6.4},null,{"$f":"'Methods&Limits'!I25","v":21.776},{"$f":"IF(E$25=\"\",\"\",IF(E$25>G78,\"Yes\",\"\"))","v":""}]
[null,null,{"$f":"'Methods&Limits'!E26","v":"EN-ISO 22854"},{"$f":"'Methods&Limits'!F26","v":2021},{"$f":"'Methods&Limits'!G26","v":2.6},null,{"$f":"'Methods&Limits'!I26","v":19.533999999999999},{"$f":"IF(E$25=\"\",\"\",IF(E$25>G79,\"Yes\",\"\"))","v":""}]
[{"$f":"'Methods&Limits'!A27","v":"*without oxygenates"},null,{"$f":"'Methods&Limits'!E27","v":"EN 15553"},{"$f":"'Methods&Limits'!F27","v":2021},{"$f":"'Methods&Limits'!G27","v":"-"},null,{"$f":"'Methods&Limits'!I27","v":"-"},{"$f":"IF(E$25=\"\",\"\",IF(E$25>G80,\"Yes\",\"\"))","v":""}]
[null,null,{"$f":"'Methods&Limits'!E28","v":"EN-ISO 22854"},{"$f":"'Methods&Limits'!F28","v":2021},{"$f":"'Methods&Limits'!G28","v":"-"},null,{"$f":"'Methods&Limits'!I28","v":"-"},{"$f":"IF(E$25=\"\",\"\",IF(E$25>G81,\"Yes\",\"\"))","v":""}]
[{"$f":"'Methods&Limits'!A29","v":"-- Olefins (RON 91 fuel only)***"},{"$f":"'Methods&Limits'!B29","v":"% V/V"},{"$f":"'Methods&Limits'!E29","v":"ASTM D1319"},{"$f":"'Methods&Limits'!F29","v":2020},{"$f":"'Methods&Limits'!G29","v":5.0999999999999996},null,{"$f":"'Methods&Limits'!I29","v":24.009},{"$f":"IF(E$25=\"\",\"\",IF(E$25>G82,\"Yes\",\"\"))","v":""}]
[{"$f":"'Methods&Limits'!A30","v":"-- Aromatics (from 2005)"},null,{"$f":"'Methods&Limits'!E30","v":"EN-ISO 22854"},{"$f":"'Methods&Limits'!F30","v":2021},{"$f":"'Methods&Limits'!G30","v":1.7},null,{"$f":"'Methods&Limits'!I30","v":36.003},{"$f":"IF(E$26=\"\",\"\",IF(E$26>G83,\"Yes\",\"\"))","v":""}]
[{"$f":"'Methods&Limits'!A31","v":"-- Benzene"},{"$f":"'Methods&Limits'!B31","v":"% V/V"},{"$f":"'Methods&Limits'!E31","v":"EN 12177"},{"$f":"'Methods&Limits'!F31","v":2022},{"$f":"'Methods&Limits'!G31","v":0.1},null,{"$f":"'Methods&Limits'!I31","v":1.0589999999999999},{"$f":"IF(E$27=\"\",\"\",IF(E$27>G84,\"Yes\",\"\"))","v":""}]
[null,null,{"$f":"'Methods&Limits'!E32","v":"EN 238"},{"$f":"'Methods&Limits'!F32","v":1996},{"$f":"'Methods&Limits'!G32","v":0.17},null,{"$f":"'Methods&Limits'!I32","v":1.1003000000000001},{"$f":"IF(E$27=\"\",\"\",IF(E$27>G85,\"Yes\",\"\"))","v":""}]
[null,null,{"$f":"'Methods&Limits'!E33","v":"EN-ISO 22854"},{"$f":"'Methods&Limits'!F33","v":2021},{"$f":"'Methods&Limits'!G33","v":0.05},null,{"$f":"'Methods&Limits'!I33","v":1.0295000000000001},{"$f":"IF(E$27=\"\",\"\",IF(E$27>G86,\"Yes\",\"\"))","v":""}]
[{"$f":"'Methods&Limits'!A34","v":"Oxygen content"},{"$f":"'Methods&Limits'!B34","v":"% (m/m)"},{"$f":"'Methods&Limits'!E34","v":"EN 1601"},{"$f":"'Methods&Limits'!F34","v":2017},{"$f":"'Methods&Limits'!G34","v":0.41},null,{"$f":"'Methods&Limits'!I34","v":3.9419},{"$f":"IF(E$27=\"\",\"\",IF(E$27>G87,\"Yes\",\"\"))","v":""}]
[null,null,{"$f":"'Methods&Limits'!E35","v":"EN 1601"},{"$f":"'Methods&Limits'!F35","v":2017},{"$f":"'Methods&Limits'!G35","v":0.41},null,{"$f":"'Methods&Limits'!I35","v":2.9419},{"$f":"IF(E$27=\"\",\"\",IF(E$27>G88,\"Yes\",\"\"))","v":""}]
[{"$f":"'Methods&Limits'!A36","v":"Oxygenates"}]
[{"$f":"'Methods&Limits'!A37","v":"-- Methanol"},{"$f":"'Methods&Limits'!B37","v":"% V/V"},{"$f":"'Methods&Limits'!E37","v":"EN 1601"},{"$f":"'Methods&Limits'!F37","v":2017},{"$f":"'Methods&Limits'!G37","v":0.3},null,{"$f":"'Methods&Limits'!I37","v":3.177},{"$f":"IF(E31=\"\",\"\",IF(E31>G90,\"Yes\",\"\"))","v":""}]
[{"$f":"'Methods&Limits'!A38","v":"-- Ethanol"},{"$f":"'Methods&Limits'!B38","v":"% V/V"},{"$f":"'Methods&Limits'!E38","v":"EN 1601"},{"$f":"'Methods&Limits'!F38","v":2017},{"$f":"'Methods&Limits'!G38","v":0.8},null,{"$f":"'Methods&Limits'!I38","v":10.472},""]
[{"$f":"'Methods&Limits'!A39","v":"-- Iso-propyl alcohol"},{"$f":"'Methods&Limits'!B39","v":"% V/V"},{"$f":"'Methods&Limits'!E39","v":"EN 1601"},{"$f":"'Methods&Limits'!F39","v":2017},{"$f":"'Methods&Limits'!G39","v":0.9},null,{"$f":"'Methods&Limits'!I39","v":12.531000000000001},""]
[{"$f":"'Methods&Limits'!A40","v":"-- Tert-butyl alcohol"},{"$f":"'Methods&Limits'!B40","v":"% V/V"},{"$f":"'Methods&Limits'!E40","v":"EN 1601"},{"$f":"'Methods&Limits'!F40","v":2017},{"$f":"'Methods&Limits'!G40","v":1},null,{"$f":"'Methods&Limits'!I40","v":15.59},""]
[{"$f":"'Methods&Limits'!A41","v":"-- Iso-butyl alcohol"},{"$f":"'Methods&Limits'!B41","v":"% V/V"},{"$f":"'Methods&Limits'!E41","v":"EN 1601"},{"$f":"'Methods&Limits'!F41","v":2017},{"$f":"'Methods&Limits'!G41","v":1},null,{"$f":"'Methods&Limits'!I41","v":15.59},""]
[{"$f":"'Methods&Limits'!A42","v":"-- Ethers with 5 or more carbon atoms per molecule"},{"$f":"'Methods&Limits'!B42","v":"% V/V"},{"$f":"'Methods&Limits'!E42","v":"EN 1601"},{"$f":"'Methods&Limits'!F42","v":2017},{"$f":"'Methods&Limits'!G42","v":1},null,{"$f":"'Methods&Limits'!I42","v":22.59},""]
[{"$f":"'Methods&Limits'!A43","v":"-- other oxygenates"},{"$f":"'Methods&Limits'!B43","v":"% V/V"},{"$f":"'Methods&Limits'!E43","v":"EN 1601"},{"$f":"'Methods&Limits'!F43","v":2017},{"$f":"'Methods&Limits'!G43","v":1},null,{"$f":"'Methods&Limits'!I43","v":15.59},""]
[{"$f":"'Methods&Limits'!A44","v":"Oxygen content"},{"$f":"'Methods&Limits'!B44","v":"% (m/m)"},{"$f":"'Methods&Limits'!E44","v":"EN 13132"},{"$f":"'Methods&Limits'!F44","v":2002},{"$f":"'Methods&Limits'!G44","v":0.3},null,{"$f":"'Methods&Limits'!I44","v":3.8770000000000002},{"$f":"IF(E28=\"\",\"\",IF(E28>G97,\"Yes\",\"\"))","v":""}]
[null,null,{"$f":"'Methods&Limits'!E45","v":"EN 13132"},{"$f":"'Methods&Limits'!F45","v":2002},{"$f":"'Methods&Limits'!G45","v":0.3},null,{"$f":"'Methods&Limits'!I45","v":2.8770000000000002},{"$f":"IF(E29=\"\",\"\",IF(E29>G98,\"Yes\",\"\"))","v":""}]
[{"$f":"'Methods&Limits'!A46","v":"Oxygenates"}]
[{"$f":"'Methods&Limits'!A47","v":"-- Methanol"},{"$f":"'Methods&Limits'!B47","v":"% V/V"},{"$f":"'Methods&Limits'!E47","v":"EN 13132"},{"$f":"'Methods&Limits'!F47","v":2002},{"$f":"'Methods&Limits'!G47","v":0.3},null,{"$f":"'Methods&Limits'!I47","v":3.177},{"$f":"IF(E31=\"\",\"\",IF(E31>G100,\"Yes\",\"\"))","v":""}]
[{"$f":"'Methods&Limits'!A48","v":"-- Ethanol"},{"$f":"'Methods&Limits'!B48","v":"% V/V"},{"$f":"'Methods&Limits'!E48","v":"EN 13132"},{"$f":"'Methods&Limits'!F48","v":2002},{"$f":"'Methods&Limits'!G48","v":0.8},null,{"$f":"'Methods&Limits'!I48","v":10.472},""]
[{"$f":"'Methods&Limits'!A49","v":"-- Iso-propyl alcohol"},{"$f":"'Methods&Limits'!B49","v":"% V/V"},{"$f":"'Methods&Limits'!E49","v":"EN 13132"},{"$f":"'Methods&Limits'!F49","v":2002},{"$f":"'Methods&Limits'!G49","v":0.8},null,{"$f":"'Methods&Limits'!I49","v":12.472},""]
[{"$f":"'Methods&Limits'!A50","v":"-- Tert-butyl alcohol"},{"$f":"'Methods&Limits'!B50","v":"% V/V"},{"$f":"'Methods&Limits'!E50","v":"EN 13132"},{"$f":"'Methods&Limits'!F50","v":2002},{"$f":"'Methods&Limits'!G50","v":1},null,{"$f":"'Methods&Limits'!I50","v":15.59},""]
[{"$f":"'Methods&Limits'!A51","v":"-- Iso-butyl alcohol"},{"$f":"'Methods&Limits'!B51","v":"% V/V"},{"$f":"'Methods&Limits'!E51","v":"EN 13132"},{"$f":"'Methods&Limits'!F51","v":2002},{"$f":"'Methods&Limits'!G51","v":1},null,{"$f":"'Methods&Limits'!I51","v":15.59},""]
[{"$f":"'Methods&Limits'!A52","v":"-- Ethers with 5 or more carbon atoms per molecule"},{"$f":"'Methods&Limits'!B52","v":"% V/V"},{"$f":"'Methods&Limits'!E52","v":"EN 13132"},{"$f":"'Methods&Limits'!F52","v":2002},{"$f":"'Methods&Limits'!G52","v":1},null,{"$f":"'Methods&Limits'!I52","v":22.59},""]
[{"$f":"'Methods&Limits'!A53","v":"-- other oxygenates"},{"$f":"'Methods&Limits'!B53","v":"% V/V"},{"$f":"'Methods&Limits'!E53","v":"EN 13132"},{"$f":"'Methods&Limits'!F53","v":2002},{"$f":"'Methods&Limits'!G53","v":1},null,{"$f":"'Methods&Limits'!I53","v":15.59},""]
[{"$f":"'Methods&Limits'!A54","v":"Oxygen content"},{"$f":"'Methods&Limits'!B54","v":"% (m/m)"},{"$f":"'Methods&Limits'!E54","v":"EN-ISO 22854"},{"$f":"'Methods&Limits'!F54","v":2021},{"$f":"'Methods&Limits'!G54","v":0.4},null,{"$f":"'Methods&Limits'!I54","v":3.9359999999999999},{"$f":"IF(E28=\"\",\"\",IF(E28>G107,\"Yes\",\"\"))","v":""}]
[null,null,{"$f":"'Methods&Limits'!E55","v":"EN-ISO 22854"},{"$f":"'Methods&Limits'!F55","v":2021},{"$f":"'Methods&Limits'!G55","v":0.4},null,{"$f":"'Methods&Limits'!I55","v":2.9359999999999999},{"$f":"IF(E29=\"\",\"\",IF(E29>G108,\"Yes\",\"\"))","v":""}]
[{"$f":"'Methods&Limits'!A56","v":"Oxyginates"}]
[{"$f":"'Methods&Limits'!A57","v":"-- Methanol"},{"$f":"'Methods&Limits'!B57","v":"% V/V"},{"$f":"'Methods&Limits'!E57","v":"EN-ISO 22854"},{"$f":"'Methods&Limits'!F57","v":2021},{"$f":"'Methods&Limits'!G57","v":0.4},null,{"$f":"'Methods&Limits'!I57","v":3.2359999999999998},{"$f":"IF(E31=\"\",\"\",IF(E31>G110,\"Yes\",\"\"))","v":""}]
[{"$f":"'Methods&Limits'!A58","v":"-- Ethanol"},{"$f":"'Methods&Limits'!B58","v":"% V/V"},{"$f":"'Methods&Limits'!E58","v":"EN-ISO 22854"},{"$f":"'Methods&Limits'!F58","v":2021},{"$f":"'Methods&Limits'!G58","v":0.6},null,{"$f":"'Methods&Limits'!I58","v":10.353999999999999},""]
[{"$f":"'Methods&Limits'!A59","v":"-- Iso-propyl alcohol"},{"$f":"'Methods&Limits'!B59","v":"% V/V"},{"$f":"'Methods&Limits'!E59","v":"EN-ISO 22854"},{"$f":"'Methods&Limits'!F59","v":2021},{"$f":"'Methods&Limits'!G59","v":0.7},null,{"$f":"'Methods&Limits'!I59","v":12.413},""]
[{"$f":"'Methods&Limits'!A60","v":"-- Tert-butyl alcohol"},{"$f":"'Methods&Limits'!B60","v":"% V/V"},{"$f":"'Methods&Limits'!E60","v":"EN-ISO 22854"},{"$f":"'Methods&Limits'!F60","v":2021},{"$f":"'Methods&Limits'!G60","v":0.7},null,{"$f":"'Methods&Limits'!I60","v":15.413},""]
[{"$f":"'Methods&Limits'!A61","v":"-- Iso-butyl alcohol"},{"$f":"'Methods&Limits'!B61","v":"% V/V"},{"$f":"'Methods&Limits'!E61","v":"EN-ISO 22854"},{"$f":"'Methods&Limits'!F61","v":2021},{"$f":"'Methods&Limits'!G61","v":0.7},null,{"$f":"'Methods&Limits'!I61","v":15.413},""]
[{"$f":"'Methods&Limits'!A62","v":"-- Ethers with 5 or more carbon atoms per molecule"},{"$f":"'Methods&Limits'!B62","v":"% V/V"},{"$f":"'Methods&Limits'!E62","v":"EN-ISO 22854"},{"$f":"'Methods&Limits'!F62","v":2021},{"$f":"'Methods&Limits'!G62","v":0.9},null,{"$f":"'Methods&Limits'!I62","v":22.530999999999999},""]
[{"$f":"'Methods&Limits'!A63","v":"-- other oxygenates"},{"$f":"'Methods&Limits'!B63","v":"% V/V"},{"$f":"'Methods&Limits'!E63","v":"EN-ISO 22854"},{"$f":"'Methods&Limits'!F63","v":2021},{"$f":"'Methods&Limits'!G63","v":0.7},null,{"$f":"'Methods&Limits'!I63","v":15.413},""]
[{"$f":"'Methods&Limits'!A64:A64","v":"Sulphur content (sulphur free, from 2005)**"},{"$f":"'Methods&Limits'!B64","v":"mg/kg"},{"$f":"'Methods&Limits'!E64","v":"EN-ISO 14596"},{"$f":"'Methods&Limits'!F64","v":2018},{"$f":"'Methods&Limits'!G64","v":5},null,{"$f":"'Methods&Limits'!I64","v":12.95},{"$f":"IF(E$38=\"\",\"\",IF(E$38>G117,\"Yes\",\"\"))","v":""}]
[null,null,{"$f":"'Methods&Limits'!E65","v":"EN 24260"},{"$f":"'Methods&Limits'!F65","v":1994},{"$f":"'Methods&Limits'!G65","v":1},null,{"$f":"'Methods&Limits'!I65","v":10.59},{"$f":"IF(E$38=\"\",\"\",IF(E$38>G118,\"Yes\",\"\"))","v":""}]
[null,null,{"$f":"'Methods&Limits'!E66","v":"EN-ISO 20846"},{"$f":"'Methods&Limits'!F66","v":2019},{"$f":"'Methods&Limits'!G66","v":2.7},null,{"$f":"'Methods&Limits'!I66","v":11.593},{"$f":"IF(E$38=\"\",\"\",IF(E$38>G119,\"Yes\",\"\"))","v":""}]
[null,null,{"$f":"'Methods&Limits'!E67","v":"EN-ISO 20884"},{"$f":"'Methods&Limits'!F67","v":2019},{"$f":"'Methods&Limits'!G67","v":3.1},null,{"$f":"'Methods&Limits'!I67","v":11.829000000000001},{"$f":"IF(E$38=\"\",\"\",IF(E$38>G120,\"Yes\",\"\"))","v":""}]
[{"$f":"'Methods&Limits'!A68:A68","v":"Lead content"},{"$f":"'Methods&Limits'!B68","v":"g/l"},{"$f":"'Methods&Limits'!E68","v":"EN 237"},{"$f":"'Methods&Limits'!F68","v":2004},{"$f":"'Methods&Limits'!G68","v":6.1999999999999998E-3},null,{"$f":"'Methods&Limits'!I68","v":8.657999999999999E-3},{"$f":"IF(E39=\"\",\"\",IF(E39>G121,\"Yes\",\"\"))","v":""}]

{"sheet":"Petrol (7)","index":22,"n_rows":121,"n_cols":18,"rows_kept":121,"cut":false,"hidden":false,"merged":[[2,1,2,4],[2,6,9,16],[3,1,3,4],[4,1,4,4],[5,1,5,4],[6,1,6,4],[7,2,7,4],[13,2,14,10],[13,11,13,14],[13,15,13,16],[14,11,14,12],[14,13,14,14],[14,15,14,16],[58,2,58,8],[58,9,58,12],[20,15,22,15],[27,15,28,15],[27,16,28,16],[43,0,43,3],[44,4,45,11],[46,4,46,11],[47,4,47,11],[48,4,48,11],[49,4,49,11],[50,4,50,11],[53,0,53,11],[71,11,71,12],[59,5,59,6],[59,9,60,9],[61,11,61,12],[62,11,62,12],[63,11,63,12],[64,11,64,12],[66,11,66,12],[67,11,67,12],[68,11,68,12],[69,11,69,12],[70,11,70,12],[59,11,59,12],[85,11,85,12],[72,11,72,12],[74,11,74,12],[75,11,75,12],[77,11,77,12],[78,11,78,12],[79,11,79,12],[80,11,80,12],[81,11,81,12],[82,11,82,12],[83,11,83,12],[84,11,84,12],[99,11,99,12],[86,11,86,12],[87,11,87,12],[89,11,89,12],[90,11,90,12],[91,11,91,12],[92,11,92,12],[93,11,93,12],[94,11,94,12],[95,11,95,12],[96,11,96,12],[97,11,97,12],[112,11,112,12],[100,11,100,12],[101,11,101,12],[102,11,102,12],[103,11,103,12],[104,11,104,12],[105,11,105,12],[106,11,106,12],[107,11,107,12],[109,11,109,12],[110,11,110,12],[111,11,111,12],[119,11,119,12],[120,11,120,12],[121,11,121,12],[122,11,122,12],[113,11,113,12],[114,11,114,12],[115,11,115,12],[116,11,116,12],[117,11,117,12],[118,11,118,12]]}
["Market Fuels used in Vehicles with Spark Ignition Engines (Petrol)",null,null,null,null,null,null,null,null,null,null,null,null,null,null,null,null,"<-- GO BACK"]
[]
["Country",{"$f":"IF(LEN('Contacts&Annual Summary'!C9) > 1,'Contacts&Annual Summary'!C9,\"\")","v":""},null,null,null,null,"Notes on completing the tables\nThe table structure has been locked to prevent modification - data can be copied and pasted, in bulk into the Reporting Results blue table cells.  Where a white row exists between rows, it will not be possible to paste over white rows and sections should be pasted separately.\n\nColumn H in the Test Methods and Analysis table is set to automatically check whether the values entered in the Reporting Results table exceed maximum or minimum Tolerance Limits.  If any exceedance is detected, please provide details in the columns to the right including the number of samples, location samples were taken from, Values and Details of any action taken to address non-compliant samples.  Compliance information is verified manually and this automated compliance check is not solely relied upon during data analysis.\n\nPlease do not unlock this template - modified templates cannot be processed and may delay reporting."]
["Reporting Year",{"$f":"'Contacts&Annual Summary'!C8","v":2023}]
["Period (Summer or Winter)","Summer"]
["Parent fuel grade","Petrol"]
["National fuel grade"]
["Summer Period (N or A)*",0,{"$f":"IF( B8=\"A\",\"1st June to 31st August (arctic)\",\"1st May to 30th September (normal)\")","v":"1st May to 30th September (normal)"}]
["The maximum bioethanol content (% v/v)",0,"Please include the bioethanol content as a numerical figure in % V/V"]
["* N = 1st May to 30th September (normal) ; A = 1st June to 31st August (arctic)."]
[]
["Reporting results"]
[]
["Parameter","Unit","Analytical and statistical results \n(Please see an explanation and examples for new columns/ information required in Cells I15 to K37 on the Introduction & Instructions tab).",null,null,null,null,null,null,null,null,"Limiting Value (1)",null,null,null,"Test method"]
[null,null,null,null,null,null,null,null,null,null,null,"National Specification, if any",null,"According to Directive 2009/30/EC",null,"(more recent versions may also be used)"]
[null,null,"No Samples","Minimum","Maximum","Median","Mean","Standard Deviation","No Samples outside 95% tolerance limit","25% of Sample Value","75% of Sample Value","Minimum","Maximum","Minimum","Maximum","Method","Date"]
["Research Octane Number","--",0,0,0,0,0,0,0,0,0,null,null,"95 (2)",null,"EN-ISO 5164",2005]
["Motor Octane Number","--",0,0,0,0,0,0,0,0,0,null,null,"85 (3)",null,"EN-ISO 5163",2005]
["Vapour Pressure, DVPE (6)","kPa",null,null,null,null,null,null,null,null,null,null,null,null,"(4)"]
["-- required for summer period only",null,0,0,0,0,0,0,0,0,0,null,null,null,{"$f":"IF(E8=\"A\",70,60)","v":60},"EN 13106-1",2007]
["Distillation",null,null,null,null,null,null,null,null,null,null,null,null,null,null,"EN-ISO 3405"]
["-- evaporated at 100 oC","% V/V",0,0,0,0,0,0,0,0,0,null,null,46,null,null,2000]
["-- evaporated at 150 oC ","% V/V",0,0,0,0,0,0,0,0,0,null,null,75]
["Hydrocarbon analysis"]
["-- Olefins","% V/V",0,0,0,0,0,0,0,0,0,null,null,null,"18.0 (5)","ASTM D 1319\nEN 15553\nEN-ISO 22854","1995\n2007\n2008"]
["-- Aromatics","% V/V",0,0,0,0,0,0,0,0,0,null,null,null,35,"EN-ISO 22854","1995\n2008"]
["-- Benzene","% V/V",0,0,0,0,0,0,0,0,0,null,null,null,1,"EN 238\nEN 12177\nEN-ISO 22854","1996\n1998\n2008"]
[{"$f":"IF(C29>0,\"Do not complete\",\"Oxygen content\")","v":"Oxygen content"},"% (m/m)",0,0,0,0,0,0,0,0,0,null,null,null,3.7,"EN 1601\nEN 13132\nEN-ISO 22854","1997\n2000\n2008"]
[{"$f":"IF(C28>0,\"Do not complete\",\"Oxygen content*\n*petrol with 5% (v/v) or less ethanol content\")","v":"Oxygen content*\n*petrol with 5% (v/v) or less ethanol content"},"% (m/m)",0,0,0,0,0,0,0,0,0,null,null,null,2.7]
["Oxygenates"]
["-- Methanol","% V/V",0,0,0,0,0,0,0,0,0,null,null,null,3]
["-- Ethanol","% V/V",0,0,0,0,0,0,0,0,0,null,null,null,10]
["-- Iso-propyl alcohol","% V/V",0,0,0,0,0,0,0,0,0,null,null,null,12,"EN 1601",1997]
["-- Tert-butyl alcohol","% V/V",0,0,0,0,0,0,0,0,0,null,null,null,15,"EN 13132",2000]
["-- Iso-butyl alcohol","% V/V",0,0,0,0,0,0,0,0,0,null,null,null,15,"EN-ISO 22854",2008]
["-- Ethers with ≥5 carbon atoms / molecule","% V/V",0,0,0,0,0,0,0,0,0,null,null,null,22]
["-- other oxygenates","% V/V",0,0,0,0,0,0,0,0,0,null,null,null,15]
["Sulphur content","mg/kg",0,0,0,0,0,0,0,0,0,null,null,null,10,"EN-ISO 14596\nEN 24260\nEN-ISO 20846\nEN-ISO 20884","1998\n1994\n2004\n2004"]
["Lead content","g/l",0,0,0,0,0,0,0,0,0,null,null,null,5.0000000000000001E-3,"EN 237",1996]
[]
[]
["Sampling frequency"]
[]
["Number of samples in month"]
["January",0,"July",0,"(1) The limiting values are \"true values\" and were established according to the procedures for limit setting in EN 228:2008  The results of individual measurements shall be interpreted following the criteria described in EN 228:2008."]
["February",0,"August",0]
["March",0,"September",0,"(2) 91 for unleaded regular grade petrol: See 2009/30/EC Annex I, Footnote 3."]
["April",0,"October",0,"(3) 81 for unleaded regular grade petrol: See 2009/30/EC Annex I, Footnote 3."]
["May",0,"November",0,"(4) 70 kPa for Member States with arctic or severe weather conditions: See 2003/30/EC Annex I, Footnotes 4 & 5."]
["June",0,"December",0,"(5) 21 for unleaded regular grade petrol: See 98/70/EC, Annex I, Footnote 6."]
[null,null,"Summer Months Total",{"$f":"SUM(B45:B50,D45:D50)","v":0},"(6) Vapour pressure waiver applies for petrol containing Bioethanol, see 2009/30/EC Annex I, Footnote 5 and Annex III."]
[]
["Other notes (optional):"]
[]
[]
[]
["Test Methods and Analysis"]
[]
["Parameter","Unit","Test specified in 2009/30/EC or EN228:2008",null,null,null,null,null,null,"Notes on exceedences"]
[null,null,"Method","Date","Reproducability, R","Tolerance limits",null,null,null,"Sample location (S,T or R)","Values","Details/action taken"]
[null,null,null,null,null,"Minimum","Maximum","Exceeded?"]
[{"$f":"'Methods&Limits'!A9","v":"Research Octane Number (RON)"},{"$f":"'Methods&Limits'!B9","v":"--"},{"$f":"'Methods&Limits'!E9","v":"EN-ISO 5164"},{"$f":"'Methods&Limits'!F9","v":2014},{"$f":"'Methods&Limits'!G9","v":0.7},{"$f":"'Methods&Limits'!H9","v":94.587000000000003},null,{"$f":"IF(D17=\"\",\"\",IF(D17<F62,\"Yes\",\"\"))","v":"Yes"}]
[{"$f":"'Methods&Limits'!A10","v":"(RON 91 fuel only)"},{"$f":"'Methods&Limits'!B10","v":"--"},{"$f":"'Methods&Limits'!E10","v":"EN-ISO 5164"},{"$f":"'Methods&Limits'!F10","v":2014},{"$f":"'Methods&Limits'!G10","v":0.7},{"$f":"'Methods&Limits'!H10","v":90.587000000000003},null,{"$f":"IF(D17=\"\",\"\",IF(D17<F63,\"Yes\",\"\"))","v":"Yes"}]
[{"$f":"'Methods&Limits'!A11","v":"Motor Octane Number (MON)"},{"$f":"'Methods&Limits'!B11","v":"--"},{"$f":"'Methods&Limits'!E11","v":"EN-ISO 5163"},{"$f":"'Methods&Limits'!F11","v":2014},{"$f":"'Methods&Limits'!G11","v":0.9},{"$f":"'Methods&Limits'!H11","v":84.468999999999994},null,{"$f":"IF(D18=\"\",\"\",IF(D18<F64,\"Yes\",\"\"))","v":"Yes"}]
[{"$f":"'Methods&Limits'!A12","v":"(RON 91 fuel only)"},{"$f":"'Methods&Limits'!B12","v":"--"},{"$f":"'Methods&Limits'!E12","v":"EN-ISO 5163"},{"$f":"'Methods&Limits'!F12","v":2014},{"$f":"'Methods&Limits'!G12","v":0.9},{"$f":"'Methods&Limits'!H12","v":80.468999999999994},null,{"$f":"IF(D18=\"\",\"\",IF(D18<F65,\"Yes\",\"\"))","v":"Yes"}]
[{"$f":"'Methods&Limits'!A13","v":"Vapour Pressure, DVPE"}]
[{"$f":"'Methods&Limits'!A14","v":"--summer period (normal)"},{"$f":"'Methods&Limits'!B14","v":"kPa"},{"$f":"'Methods&Limits'!E14","v":"EN 13016-1"},{"$f":"'Methods&Limits'!F14","v":2018},{"$f":"'Methods&Limits'!G14","v":2.2000000000000002},null,{"$f":"'Methods&Limits'!I14","v":61.298000000000002},{"$f":"IF(E20>G67,\"Yes\",\"\")","v":""}]
[{"$f":"'Methods&Limits'!A15","v":"-- Petrol with bioethanol content 0-2"},{"$f":"'Methods&Limits'!B15","v":"kPa"},{"$f":"'Methods&Limits'!E15","v":"EN 1601"},{"$f":"'Methods&Limits'!F15","v":2017},{"$f":"'Methods&Limits'!G15","v":2.2999999999999998},null,{"$f":"'Methods&Limits'!I15","v":67.307000000000002},{"$f":"IF(E20>G68,\"Yes\",\"\")","v":""}]
[{"$f":"'Methods&Limits'!A16","v":"-- Petrol with bioethanol content 2-4"},{"$f":"'Methods&Limits'!B16","v":"kPa"},{"$f":"'Methods&Limits'!E16","v":"EN 1601"},{"$f":"'Methods&Limits'!F16","v":2017},{"$f":"'Methods&Limits'!G16","v":2.2999999999999998},null,{"$f":"'Methods&Limits'!I16","v":69.156999999999996},{"$f":"IF(E20>G69,\"Yes\",\"\")","v":""}]
[{"$f":"'Methods&Limits'!A17","v":"-- Petrol with bioethanol content 4-6"},{"$f":"'Methods&Limits'!B17","v":"kPa"},{"$f":"'Methods&Limits'!E17","v":"EN 1601"},{"$f":"'Methods&Limits'!F17","v":2017},{"$f":"'Methods&Limits'!G17","v":2.2999999999999998},null,{"$f":"'Methods&Limits'!I17","v":69.356999999999999},{"$f":"IF(E20>G70,\"Yes\",\"\")","v":""}]
[{"$f":"'Methods&Limits'!A18","v":"-- Petrol with bioethanol content 6-8"},{"$f":"'Methods&Limits'!B18","v":"kPa"},{"$f":"'Methods&Limits'!E18","v":"EN 1601"},{"$f":"'Methods&Limits'!F18","v":2017},{"$f":"'Methods&Limits'!G18","v":2.2999999999999998},null,{"$f":"'Methods&Limits'!I18","v":69.236999999999995},{"$f":"IF(E20>G71,\"Yes\",\"\")","v":""}]
[{"$f":"'Methods&Limits'!A19","v":"-- Petrol with bioethanol content 8-10"},{"$f":"'Methods&Limits'!B19","v":"kPa"},{"$f":"'Methods&Limits'!E19","v":"EN 1601"},{"$f":"'Methods&Limits'!F19","v":2017},{"$f":"'Methods&Limits'!G19","v":2.2999999999999998},null,{"$f":"'Methods&Limits'!I19","v":69.117000000000004},{"$f":"IF(E20>G72,\"Yes\",\"\")","v":""}]
[{"$f":"'Methods&Limits'!A20","v":"--summer period (arctic or severe weather conditions)"},{"$f":"'Methods&Limits'!B20","v":"kPa"},{"$f":"'Methods&Limits'!E20","v":"EN 13016-1"},{"$f":"'Methods&Limits'!F20","v":2018},{"$f":"'Methods&Limits'!G20","v":2.2999999999999998},null,{"$f":"'Methods&Limits'!I20","v":71.356999999999999},{"$f":"IF(E20>G73,\"Yes\",\"\")","v":""}]
[{"$f":"'Methods&Limits'!A21","v":"Distillation *"}]
[{"$f":"'Methods&Limits'!A22","v":"--evaporated at 100 oC"},{"$f":"'Methods&Limits'!B22","v":"% V/V"},{"$f":"'Methods&Limits'!E22","v":"EN-ISO 3405"},{"$f":"'Methods&Limits'!F22","v":2020},{"$f":"'Methods&Limits'!G22","v":4},{"$f":"'Methods&Limits'!H22","v":43.64},null,{"$f":"IF(D22=\"\",\"\",IF(D22<F75,\"Yes\",\"\"))","v":"Yes"}]
[{"$f":"'Methods&Limits'!A23","v":"-- evaporated at 150 oC "},{"$f":"'Methods&Limits'!B23","v":"% V/V"},{"$f":"'Methods&Limits'!E23","v":"EN-ISO 3405"},{"$f":"'Methods&Limits'!F23","v":2020},{"$f":"'Methods&Limits'!G23","v":4},{"$f":"'Methods&Limits'!H23","v":72.64},null,{"$f":"IF(D23=\"\",\"\",IF(D23<F76,\"Yes\",\"\"))","v":"Yes"}]
[{"$f":"'Methods&Limits'!A24","v":"Hydrocarbon analysis"},null,null,null,null,null,null,{"$f":"IF(D24<F77,\"Yes\",\"\")","v":""}]
[{"$f":"'Methods&Limits'!A25","v":"-- Olefins"},{"$f":"'Methods&Limits'!B25","v":"% V/V"},{"$f":"'Methods&Limits'!E25","v":"EN 15553"},{"$f":"'Methods&Limits'!F25","v":2021},{"$f":"'Methods&Limits'!G25","v":6.4},null,{"$f":"'Methods&Limits'!I25","v":21.776},{"$f":"IF($E$25>G78,\"Yes\",\"\")","v":""}]
[null,null,{"$f":"'Methods&Limits'!E26","v":"EN-ISO 22854"},{"$f":"'Methods&Limits'!F26","v":2021},{"$f":"'Methods&Limits'!G26","v":2.6},null,{"$f":"'Methods&Limits'!I26","v":19.533999999999999},{"$f":"IF($E$25>G79,\"Yes\",\"\")","v":""}]
[{"$f":"'Methods&Limits'!A27","v":"*without oxygenates"},null,{"$f":"'Methods&Limits'!E27","v":"EN 15553"},{"$f":"'Methods&Limits'!F27","v":2021},{"$f":"'Methods&Limits'!G27","v":"-"},null,{"$f":"'Methods&Limits'!I27","v":"-"},{"$f":"IF($E$25>G80,\"Yes\",\"\")","v":""}]
[null,null,{"$f":"'Methods&Limits'!E28","v":"EN-ISO 22854"},{"$f":"'Methods&Limits'!F28","v":2021},{"$f":"'Methods&Limits'!G28","v":"-"},null,{"$f":"'Methods&Limits'!I28","v":"-"},{"$f":"IF($E$25>G81,\"Yes\",\"\")","v":""}]
[{"$f":"'Methods&Limits'!A29","v":"-- Olefins (RON 91 fuel only)***"},{"$f":"'Methods&Limits'!B29","v":"% V/V"},{"$f":"'Methods&Limits'!E29","v":"ASTM D1319"},{"$f":"'Methods&Limits'!F29","v":2020},{"$f":"'Methods&Limits'!G29","v":5.0999999999999996},null,{"$f":"'Methods&Limits'!I29","v":24.009},{"$f":"IF($E$25>G82,\"Yes\",\"\")","v":""}]
[{"$f":"'Methods&Limits'!A30","v":"-- Aromatics (from 2005)"},null,{"$f":"'Methods&Limits'!E30","v":"EN-ISO 22854"},{"$f":"'Methods&Limits'!F30","v":2021},{"$f":"'Methods&Limits'!G30","v":1.7},null,{"$f":"'Methods&Limits'!I30","v":36.003},{"$f":"IF($E$26>G83,\"Yes\",\"\")","v":""}]
[{"$f":"'Methods&Limits'!A31","v":"-- Benzene"},{"$f":"'Methods&Limits'!B31","v":"% V/V"},{"$f":"'Methods&Limits'!E31","v":"EN 12177"},{"$f":"'Methods&Limits'!F31","v":2022},{"$f":"'Methods&Limits'!G31","v":0.1},null,{"$f":"'Methods&Limits'!I31","v":1.0589999999999999},{"$f":"IF(E27>G84,\"Yes\",\"\")","v":""}]
[null,null,{"$f":"'Methods&Limits'!E32","v":"EN 238"},{"$f":"'Methods&Limits'!F32","v":1996},{"$f":"'Methods&Limits'!G32","v":0.17},null,{"$f":"'Methods&Limits'!I32","v":1.1003000000000001},{"$f":"IF(E27>G85,\"Yes\",\"\")","v":""}]
[null,null,{"$f":"'Methods&Limits'!E33","v":"EN-ISO 22854"},{"$f":"'Methods&Limits'!F33","v":2021},{"$f":"'Methods&Limits'!G33","v":0.05},null,{"$f":"'Methods&Limits'!I33","v":1.0295000000000001},{"$f":"IF(E27>G86,\"Yes\",\"\")","v":""}]
[{"$f":"'Methods&Limits'!A34","v":"Oxygen content"},{"$f":"'Methods&Limits'!B34","v":"% (m/m)"},{"$f":"'Methods&Limits'!E34","v":"EN 1601"},{"$f":"'Methods&Limits'!F34","v":2017},{"$f":"'Methods&Limits'!G34","v":0.41},null,{"$f":"'Methods&Limits'!I34","v":3.9419},{"$f":"IF(E28>G87,\"Yes\",\"\")","v":""}]
[null,null,{"$f":"'Methods&Limits'!E35","v":"EN 1601"},{"$f":"'Methods&Limits'!F35","v":2017},{"$f":"'Methods&Limits'!G35","v":0.41},null,{"$f":"'Methods&Limits'!I35","v":2.9419},{"$f":"IF(E29>G88,\"Yes\",\"\")","v":""}]
[{"$f":"'Methods&Limits'!A36","v":"Oxygenates"}]
[{"$f":"'Methods&Limits'!A37","v":"-- Methanol"},{"$f":"'Methods&Limits'!B37","v":"% V/V"},{"$f":"'Methods&Limits'!E37","v":"EN 1601"},{"$f":"'Methods&Limits'!F37","v":2017},{"$f":"'Methods&Limits'!G37","v":0.3},null,{"$f":"'Methods&Limits'!I37","v":3.177},{"$f":"IF(E31>G90,\"Yes\",\"\")","v":""}]
[{"$f":"'Methods&Limits'!A38","v":"-- Ethanol"},{"$f":"'Methods&Limits'!B38","v":"% V/V"},{"$f":"'Methods&Limits'!E38","v":"EN 1601"},{"$f":"'Methods&Limits'!F38","v":2017},{"$f":"'Methods&Limits'!G38","v":0.8},null,{"$f":"'Methods&Limits'!I38","v":10.472},""]
[{"$f":"'Methods&Limits'!A39","v":"-- Iso-propyl alcohol"},{"$f":"'Methods&Limits'!B39","v":"% V/V"},{"$f":"'Methods&Limits'!E39","v":"EN 1601"},{"$f":"'Methods&Limits'!F39","v":2017},{"$f":"'Methods&Limits'!G39","v":0.9},null,{"$f":"'Methods&Limits'!I39","v":12.531000000000001},""]
[{"$f":"'Methods&Limits'!A40","v":"-- Tert-butyl alcohol"},{"$f":"'Methods&Limits'!B40","v":"% V/V"},{"$f":"'Methods&Limits'!E40","v":"EN 1601"},{"$f":"'Methods&Limits'!F40","v":2017},{"$f":"'Methods&Limits'!G40","v":1},null,{"$f":"'Methods&Limits'!I40","v":15.59},""]
[{"$f":"'Methods&Limits'!A41","v":"-- Iso-butyl alcohol"},{"$f":"'Methods&Limits'!B41","v":"% V/V"},{"$f":"'Methods&Limits'!E41","v":"EN 1601"},{"$f":"'Methods&Limits'!F41","v":2017},{"$f":"'Methods&Limits'!G41","v":1},null,{"$f":"'Methods&Limits'!I41","v":15.59},""]
[{"$f":"'Methods&Limits'!A42","v":"-- Ethers with 5 or more carbon atoms per molecule"},{"$f":"'Methods&Limits'!B42","v":"% V/V"},{"$f":"'Methods&Limits'!E42","v":"EN 1601"},{"$f":"'Methods&Limits'!F42","v":2017},{"$f":"'Methods&Limits'!G42","v":1},null,{"$f":"'Methods&Limits'!I42","v":22.59},""]
[{"$f":"'Methods&Limits'!A43","v":"-- other oxygenates"},{"$f":"'Methods&Limits'!B43","v":"% V/V"},{"$f":"'Methods&Limits'!E43","v":"EN 1601"},{"$f":"'Methods&Limits'!F43","v":2017},{"$f":"'Methods&Limits'!G43","v":1},null,{"$f":"'Methods&Limits'!I43","v":15.59},""]
[{"$f":"'Methods&Limits'!A44","v":"Oxygen content"},{"$f":"'Methods&Limits'!B44","v":"% (m/m)"},{"$f":"'Methods&Limits'!E44","v":"EN 13132"},{"$f":"'Methods&Limits'!F44","v":2002},{"$f":"'Methods&Limits'!G44","v":0.3},null,{"$f":"'Methods&Limits'!I44","v":3.8770000000000002},{"$f":"IF(E28>G97,\"Yes\",\"\")","v":""}]
[null,null,{"$f":"'Methods&Limits'!E45","v":"EN 13132"},{"$f":"'Methods&Limits'!F45","v":2002},{"$f":"'Methods&Limits'!G45","v":0.3},null,{"$f":"'Methods&Limits'!I45","v":2.8770000000000002},{"$f":"IF(E29>G98,\"Yes\",\"\")","v":""}]
[{"$f":"'Methods&Limits'!A46","v":"Oxygenates"}]
[{"$f":"'Methods&Limits'!A47","v":"-- Methanol"},{"$f":"'Methods&Limits'!B47","v":"% V/V"},{"$f":"'Methods&Limits'!E47","v":"EN 13132"},{"$f":"'Methods&Limits'!F47","v":2002},{"$f":"'Methods&Limits'!G47","v":0.3},null,{"$f":"'Methods&Limits'!I47","v":3.177},{"$f":"IF(E31>G100,\"Yes\",\"\")","v":""}]
[{"$f":"'Methods&Limits'!A48","v":"-- Ethanol"},{"$f":"'Methods&Limits'!B48","v":"% V/V"},{"$f":"'Methods&Limits'!E48","v":"EN 13132"},{"$f":"'Methods&Limits'!F48","v":2002},{"$f":"'Methods&Limits'!G48","v":0.8},null,{"$f":"'Methods&Limits'!I48","v":10.472},""]
[{"$f":"'Methods&Limits'!A49","v":"-- Iso-propyl alcohol"},{"$f":"'Methods&Limits'!B49","v":"% V/V"},{"$f":"'Methods&Limits'!E49","v":"EN 13132"},{"$f":"'Methods&Limits'!F49","v":2002},{"$f":"'Methods&Limits'!G49","v":0.8},null,{"$f":"'Methods&Limits'!I49","v":12.472},""]
[{"$f":"'Methods&Limits'!A50","v":"-- Tert-butyl alcohol"},{"$f":"'Methods&Limits'!B50","v":"% V/V"},{"$f":"'Methods&Limits'!E50","v":"EN 13132"},{"$f":"'Methods&Limits'!F50","v":2002},{"$f":"'Methods&Limits'!G50","v":1},null,{"$f":"'Methods&Limits'!I50","v":15.59},""]
[{"$f":"'Methods&Limits'!A51","v":"-- Iso-butyl alcohol"},{"$f":"'Methods&Limits'!B51","v":"% V/V"},{"$f":"'Methods&Limits'!E51","v":"EN 13132"},{"$f":"'Methods&Limits'!F51","v":2002},{"$f":"'Methods&Limits'!G51","v":1},null,{"$f":"'Methods&Limits'!I51","v":15.59},""]
[{"$f":"'Methods&Limits'!A52","v":"-- Ethers with 5 or more carbon atoms per molecule"},{"$f":"'Methods&Limits'!B52","v":"% V/V"},{"$f":"'Methods&Limits'!E52","v":"EN 13132"},{"$f":"'Methods&Limits'!F52","v":2002},{"$f":"'Methods&Limits'!G52","v":1},null,{"$f":"'Methods&Limits'!I52","v":22.59},""]
[{"$f":"'Methods&Limits'!A53","v":"-- other oxygenates"},{"$f":"'Methods&Limits'!B53","v":"% V/V"},{"$f":"'Methods&Limits'!E53","v":"EN 13132"},{"$f":"'Methods&Limits'!F53","v":2002},{"$f":"'Methods&Limits'!G53","v":1},null,{"$f":"'Methods&Limits'!I53","v":15.59},""]
[{"$f":"'Methods&Limits'!A54","v":"Oxygen content"},{"$f":"'Methods&Limits'!B54","v":"% (m/m)"},{"$f":"'Methods&Limits'!E54","v":"EN-ISO 22854"},{"$f":"'Methods&Limits'!F54","v":2021},{"$f":"'Methods&Limits'!G54","v":0.4},null,{"$f":"'Methods&Limits'!I54","v":3.9359999999999999},{"$f":"IF(E28>G107,\"Yes\",\"\")","v":""}]
[null,null,{"$f":"'Methods&Limits'!E55","v":"EN-ISO 22854"},{"$f":"'Methods&Limits'!F55","v":2021},{"$f":"'Methods&Limits'!G55","v":0.4},null,{"$f":"'Methods&Limits'!I55","v":2.9359999999999999},{"$f":"IF(E29>G108,\"Yes\",\"\")","v":""}]
[{"$f":"'Methods&Limits'!A56","v":"Oxyginates"}]
[{"$f":"'Methods&Limits'!A57","v":"-- Methanol"},{"$f":"'Methods&Limits'!B57","v":"% V/V"},{"$f":"'Methods&Limits'!E57","v":"EN-ISO 22854"},{"$f":"'Methods&Limits'!F57","v":2021},{"$f":"'Methods&Limits'!G57","v":0.4},null,{"$f":"'Methods&Limits'!I57","v":3.2359999999999998},{"$f":"IF(E31>G110,\"Yes\",\"\")","v":""}]
[{"$f":"'Methods&Limits'!A58","v":"-- Ethanol"},{"$f":"'Methods&Limits'!B58","v":"% V/V"},{"$f":"'Methods&Limits'!E58","v":"EN-ISO 22854"},{"$f":"'Methods&Limits'!F58","v":2021},{"$f":"'Methods&Limits'!G58","v":0.6},null,{"$f":"'Methods&Limits'!I58","v":10.353999999999999},""]
[{"$f":"'Methods&Limits'!A59","v":"-- Iso-propyl alcohol"},{"$f":"'Methods&Limits'!B59","v":"% V/V"},{"$f":"'Methods&Limits'!E59","v":"EN-ISO 22854"},{"$f":"'Methods&Limits'!F59","v":2021},{"$f":"'Methods&Limits'!G59","v":0.7},null,{"$f":"'Methods&Limits'!I59","v":12.413},""]
[{"$f":"'Methods&Limits'!A60","v":"-- Tert-butyl alcohol"},{"$f":"'Methods&Limits'!B60","v":"% V/V"},{"$f":"'Methods&Limits'!E60","v":"EN-ISO 22854"},{"$f":"'Methods&Limits'!F60","v":2021},{"$f":"'Methods&Limits'!G60","v":0.7},null,{"$f":"'Methods&Limits'!I60","v":15.413},""]
[{"$f":"'Methods&Limits'!A61","v":"-- Iso-butyl alcohol"},{"$f":"'Methods&Limits'!B61","v":"% V/V"},{"$f":"'Methods&Limits'!E61","v":"EN-ISO 22854"},{"$f":"'Methods&Limits'!F61","v":2021},{"$f":"'Methods&Limits'!G61","v":0.7},null,{"$f":"'Methods&Limits'!I61","v":15.413},""]
[{"$f":"'Methods&Limits'!A62","v":"-- Ethers with 5 or more carbon atoms per molecule"},{"$f":"'Methods&Limits'!B62","v":"% V/V"},{"$f":"'Methods&Limits'!E62","v":"EN-ISO 22854"},{"$f":"'Methods&Limits'!F62","v":2021},{"$f":"'Methods&Limits'!G62","v":0.9},null,{"$f":"'Methods&Limits'!I62","v":22.530999999999999},""]
[{"$f":"'Methods&Limits'!A63","v":"-- other oxygenates"},{"$f":"'Methods&Limits'!B63","v":"% V/V"},{"$f":"'Methods&Limits'!E63","v":"EN-ISO 22854"},{"$f":"'Methods&Limits'!F63","v":2021},{"$f":"'Methods&Limits'!G63","v":0.7},null,{"$f":"'Methods&Limits'!I63","v":15.413},""]
[{"$f":"'Methods&Limits'!A64:A64","v":"Sulphur content (sulphur free, from 2005)**"},{"$f":"'Methods&Limits'!B64","v":"mg/kg"},{"$f":"'Methods&Limits'!E64","v":"EN-ISO 14596"},{"$f":"'Methods&Limits'!F64","v":2018},{"$f":"'Methods&Limits'!G64","v":5},null,{"$f":"'Methods&Limits'!I64","v":12.95},{"$f":"IF(E$38>G117,\"Yes\",\"\")","v":""}]
[null,null,{"$f":"'Methods&Limits'!E65","v":"EN 24260"},{"$f":"'Methods&Limits'!F65","v":1994},{"$f":"'Methods&Limits'!G65","v":1},null,{"$f":"'Methods&Limits'!I65","v":10.59},{"$f":"IF(E$38>G118,\"Yes\",\"\")","v":""}]
[null,null,{"$f":"'Methods&Limits'!E66","v":"EN-ISO 20846"},{"$f":"'Methods&Limits'!F66","v":2019},{"$f":"'Methods&Limits'!G66","v":2.7},null,{"$f":"'Methods&Limits'!I66","v":11.593},{"$f":"IF(E$38>G119,\"Yes\",\"\")","v":""}]
[null,null,{"$f":"'Methods&Limits'!E67","v":"EN-ISO 20884"},{"$f":"'Methods&Limits'!F67","v":2019},{"$f":"'Methods&Limits'!G67","v":3.1},null,{"$f":"'Methods&Limits'!I67","v":11.829000000000001},{"$f":"IF(E$38>G120,\"Yes\",\"\")","v":""}]
[{"$f":"'Methods&Limits'!A68:A68","v":"Lead content"},{"$f":"'Methods&Limits'!B68","v":"g/l"},{"$f":"'Methods&Limits'!E68","v":"EN 237"},{"$f":"'Methods&Limits'!F68","v":2004},{"$f":"'Methods&Limits'!G68","v":6.1999999999999998E-3},null,{"$f":"'Methods&Limits'!I68","v":8.657999999999999E-3},{"$f":"IF($E$39>G121,\"Yes\",\"\")","v":""}]

{"sheet":"Petrol (8)","index":23,"n_rows":121,"n_cols":18,"rows_kept":121,"cut":false,"hidden":false,"merged":[[2,1,2,4],[2,6,9,16],[3,1,3,4],[4,1,4,4],[5,1,5,4],[6,1,6,4],[7,2,7,4],[13,2,14,10],[13,11,13,14],[13,15,13,16],[14,11,14,12],[14,13,14,14],[14,15,14,16],[58,2,58,8],[58,9,58,12],[20,15,22,15],[27,15,28,15],[27,16,28,16],[43,0,43,3],[44,4,45,11],[46,4,46,11],[47,4,47,11],[48,4,48,11],[49,4,49,11],[50,4,50,11],[53,0,53,11],[71,11,71,12],[59,5,59,6],[59,9,60,9],[61,11,61,12],[62,11,62,12],[63,11,63,12],[64,11,64,12],[66,11,66,12],[67,11,67,12],[68,11,68,12],[69,11,69,12],[70,11,70,12],[59,11,59,12],[85,11,85,12],[72,11,72,12],[74,11,74,12],[75,11,75,12],[77,11,77,12],[78,11,78,12],[79,11,79,12],[80,11,80,12],[81,11,81,12],[82,11,82,12],[83,11,83,12],[84,11,84,12],[99,11,99,12],[86,11,86,12],[87,11,87,12],[89,11,89,12],[90,11,90,12],[91,11,91,12],[92,11,92,12],[93,11,93,12],[94,11,94,12],[95,11,95,12],[96,11,96,12],[97,11,97,12],[112,11,112,12],[100,11,100,12],[101,11,101,12],[102,11,102,12],[103,11,103,12],[104,11,104,12],[105,11,105,12],[106,11,106,12],[107,11,107,12],[109,11,109,12],[110,11,110,12],[111,11,111,12],[119,11,119,12],[120,11,120,12],[121,11,121,12],[122,11,122,12],[113,11,113,12],[114,11,114,12],[115,11,115,12],[116,11,116,12],[117,11,117,12],[118,11,118,12]]}
["Market Fuels used in Vehicles with Spark Ignition Engines (Petrol)",null,null,null,null,null,null,null,null,null,null,null,null,null,null,null,null,"<-- GO BACK"]
[]
["Country",{"$f":"IF(LEN('Contacts&Annual Summary'!C9) > 1,'Contacts&Annual Summary'!C9,\"\")","v":""},null,null,null,null,"Notes on completing the tables\nThe table structure has been locked to prevent modification - data can be copied and pasted, in bulk into the Reporting Results blue table cells.  Where a white row exists between rows, it will not be possible to paste over white rows and sections should be pasted separately.\n\nColumn H in the Test Methods and Analysis table is set to automatically check whether the values entered in the Reporting Results table exceed maximum or minimum Tolerance Limits.  If any exceedance is detected, please provide details in the columns to the right including the number of samples, location samples were taken from, Values and Details of any action taken to address non-compliant samples.  Compliance information is verified manually and this automated compliance check is not solely relied upon during data analysis.\n\nPlease do not unlock this template - modified templates cannot be processed and may delay reporting."]
["Reporting Year",{"$f":"'Contacts&Annual Summary'!C8","v":2023}]
["Period (Summer or Winter)","Winter"]
["Parent fuel grade","Petrol"]
["National fuel grade",{"$f":"'Petrol (7)'!B7","v":0}]
["Summer Period (N or A)*",0,{"$f":"IF( B8=\"A\",\"1st June to 31st August (arctic)\",\"1st May to 30th September (normal)\")","v":"1st May to 30th September (normal)"}]
["The maximum bioethanol content (% v/v)",0,"Please include the bioethanol content as a numerical figure in % V/V"]
["* N = 1st May to 30th September (normal) ; A = 1st June to 31st August (arctic)."]
[]
["Reporting results"]
[]
["Parameter","Unit","Analytical and statistical results \n(Please see an explanation and examples for new columns/ information required in Cells I15 to K37 on the Introduction & Instructions tab).",null,null,null,null,null,null,null,null,"Limiting Value (1)",null,null,null,"Test method"]
[null,null,null,null,null,null,null,null,null,null,null,"National Specification, if any",null,"According to Directive 2009/30/EC",null,"(more recent versions may also be used)"]
[null,null,"No Samples","Minimum","Maximum","Median","Mean","Standard Deviation","No Samples outside 95% tolerance limit","25% of Sample Value","75% of Sample Value","Minimum","Maximum","Minimum","Maximum","Method","Date"]
["Research Octane Number","--",0,0,0,0,0,0,0,0,0,null,null,"95 (2)",null,"EN-ISO 5164",2005]
["Motor Octane Number","--",0,0,0,0,0,0,0,0,0,null,null,"85 (3)",null,"EN-ISO 5163",2005]
["Vapour Pressure, DVPE (6)","kPa",null,null,null,null,null,null,null,null,null,null,null,null,"(4)"]
["-- required for summer period only",null,0,0,0,0,0,0,0,0,0,null,null,null,{"$f":"IF(E8=\"A\",70,60)","v":60},"EN 13106-1",2007]
["Distillation",null,null,null,null,null,null,null,null,null,null,null,null,null,null,"EN-ISO 3405"]
["-- evaporated at 100 oC","% V/V",0,0,0,0,0,0,0,0,0,null,null,46,null,null,2000]
["-- evaporated at 150 oC ","% V/V",0,0,0,0,0,0,0,0,0,null,null,75]
["Hydrocarbon analysis"]
["-- Olefins","% V/V",0,0,0,0,0,0,0,0,0,null,null,null,"18.0 (5)","ASTM D 1319\nEN 15553\nEN-ISO 22854","1995\n2007\n2008"]
["-- Aromatics","% V/V",0,0,0,0,0,0,0,0,0,null,null,null,35,"EN-ISO 22854","1995\n2008"]
["-- Benzene","% V/V",0,0,0,0,0,0,0,0,0,null,null,null,1,"EN 238\nEN 12177\nEN-ISO 22854","1996\n1998\n2008"]
[{"$f":"IF(C29>0,\"Do not complete\",\"Oxygen content\")","v":"Oxygen content"},"% (m/m)",0,0,0,0,0,0,0,0,0,null,null,null,3.7,"EN 1601\nEN 13132\nEN-ISO 22854","1997\n2000\n2008"]
[{"$f":"IF(C28>0,\"Do not complete\",\"Oxygen content*\n*petrol with 5% (v/v) or less ethanol content\")","v":"Oxygen content*\n*petrol with 5% (v/v) or less ethanol content"},"% (m/m)",0,0,0,0,0,0,0,0,0,null,null,null,2.7]
["Oxygenates"]
["-- Methanol","% V/V",0,0,0,0,0,0,0,0,0,null,null,null,3]
["-- Ethanol","% V/V",0,0,0,0,0,0,0,0,0,null,null,null,10]
["-- Iso-propyl alcohol","% V/V",0,0,0,0,0,0,0,0,0,null,null,null,12,"EN 1601",1997]
["-- Tert-butyl alcohol","% V/V",0,0,0,0,0,0,0,0,0,null,null,null,15,"EN 13132",2000]
["-- Iso-butyl alcohol","% V/V",0,0,0,0,0,0,0,0,0,null,null,null,15,"EN-ISO 22854",2008]
["-- Ethers with ≥5 carbon atoms / molecule","% V/V",0,0,0,0,0,0,0,0,0,null,null,null,22]
["-- other oxygenates","% V/V",0,0,0,0,0,0,0,0,0,null,null,null,15]
["Sulphur content","mg/kg",0,0,0,0,0,0,0,0,0,null,null,null,10,"EN-ISO 14596\nEN 24260\nEN-ISO 20846\nEN-ISO 20884","1998\n1994\n2004\n2004"]
["Lead content","g/l",0,0,0,0,0,0,0,0,0,null,null,null,5.0000000000000001E-3,"EN 237",1996]
[]
[]
["Sampling frequency"]
[]
["Number of samples in month"]
["January",0,"July",0,"(1) The limiting values are \"true values\" and were established according to the procedures for limit setting in EN 228:2008  The results of individual measurements shall be interpreted following the criteria described in EN 228:2008."]
["February",0,"August",0]
["March",0,"September",0,"(2) 91 for unleaded regular grade petrol: See 2009/30/EC Annex I, Footnote 3."]
["April",0,"October",0,"(3) 81 for unleaded regular grade petrol: See 2009/30/EC Annex I, Footnote 3."]
["May",0,"November",0,"(4) 70 kPa for Member States with arctic or severe weather conditions: See 2003/30/EC Annex I, Footnotes 4 & 5."]
["June",0,"December",0,"(5) 21 for unleaded regular grade petrol: See 98/70/EC, Annex I, Footnote 6."]
[null,null,"Winter Months Total",{"$f":"SUM(B45:B50,D45:D50)","v":0},"(6) Vapour pressure waiver applies for petrol containing Bioethanol, see 2009/30/EC Annex I, Footnote 5 and Annex III."]
[]
["Other notes (optional):"]
[]
[]
[]
["Test Methods and Analysis"]
[]
["Parameter","Unit","Test specified in 2009/30/EC or EN228:2008",null,null,null,null,null,null,"Notes on exceedences"]
[null,null,"Method","Date","Reproducability, R","Tolerance limits",null,null,null,"Sample location (S,T or R)","Values","Details/action taken"]
[null,null,null,null,null,"Minimum","Maximum","Exceeded?"]
[{"$f":"'Methods&Limits'!A9","v":"Research Octane Number (RON)"},{"$f":"'Methods&Limits'!B9","v":"--"},{"$f":"'Methods&Limits'!E9","v":"EN-ISO 5164"},{"$f":"'Methods&Limits'!F9","v":2014},{"$f":"'Methods&Limits'!G9","v":0.7},{"$f":"'Methods&Limits'!H9","v":94.587000000000003},null,{"$f":"IF(D17=\"\",\"\",IF(D17<F62,\"Yes\",\"\"))","v":"Yes"}]
[{"$f":"'Methods&Limits'!A10","v":"(RON 91 fuel only)"},{"$f":"'Methods&Limits'!B10","v":"--"},{"$f":"'Methods&Limits'!E10","v":"EN-ISO 5164"},{"$f":"'Methods&Limits'!F10","v":2014},{"$f":"'Methods&Limits'!G10","v":0.7},{"$f":"'Methods&Limits'!H10","v":90.587000000000003},null,{"$f":"IF(D17=\"\",\"\",IF(D17<F63,\"Yes\",\"\"))","v":"Yes"}]
[{"$f":"'Methods&Limits'!A11","v":"Motor Octane Number (MON)"},{"$f":"'Methods&Limits'!B11","v":"--"},{"$f":"'Methods&Limits'!E11","v":"EN-ISO 5163"},{"$f":"'Methods&Limits'!F11","v":2014},{"$f":"'Methods&Limits'!G11","v":0.9},{"$f":"'Methods&Limits'!H11","v":84.468999999999994},null,{"$f":"IF(D18=\"\",\"\",IF(D18<F64,\"Yes\",\"\"))","v":"Yes"}]
[{"$f":"'Methods&Limits'!A12","v":"(RON 91 fuel only)"},{"$f":"'Methods&Limits'!B12","v":"--"},{"$f":"'Methods&Limits'!E12","v":"EN-ISO 5163"},{"$f":"'Methods&Limits'!F12","v":2014},{"$f":"'Methods&Limits'!G12","v":0.9},{"$f":"'Methods&Limits'!H12","v":80.468999999999994},null,{"$f":"IF(D18=\"\",\"\",IF(D18<F65,\"Yes\",\"\"))","v":"Yes"}]
[{"$f":"'Methods&Limits'!A13","v":"Vapour Pressure, DVPE"}]
[{"$f":"'Methods&Limits'!A14","v":"--summer period (normal)"},{"$f":"'Methods&Limits'!B14","v":"kPa"},{"$f":"'Methods&Limits'!E14","v":"EN 13016-1"},{"$f":"'Methods&Limits'!F14","v":2018},{"$f":"'Methods&Limits'!G14","v":2.2000000000000002},null,{"$f":"'Methods&Limits'!I14","v":61.298000000000002}]
[{"$f":"'Methods&Limits'!A15","v":"-- Petrol with bioethanol content 0-2"},{"$f":"'Methods&Limits'!B15","v":"kPa"},{"$f":"'Methods&Limits'!E15","v":"EN 1601"},{"$f":"'Methods&Limits'!F15","v":2017},{"$f":"'Methods&Limits'!G15","v":2.2999999999999998},null,{"$f":"'Methods&Limits'!I15","v":67.307000000000002}]
[{"$f":"'Methods&Limits'!A16","v":"-- Petrol with bioethanol content 2-4"},{"$f":"'Methods&Limits'!B16","v":"kPa"},{"$f":"'Methods&Limits'!E16","v":"EN 1601"},{"$f":"'Methods&Limits'!F16","v":2017},{"$f":"'Methods&Limits'!G16","v":2.2999999999999998},null,{"$f":"'Methods&Limits'!I16","v":69.156999999999996}]
[{"$f":"'Methods&Limits'!A17","v":"-- Petrol with bioethanol content 4-6"},{"$f":"'Methods&Limits'!B17","v":"kPa"},{"$f":"'Methods&Limits'!E17","v":"EN 1601"},{"$f":"'Methods&Limits'!F17","v":2017},{"$f":"'Methods&Limits'!G17","v":2.2999999999999998},null,{"$f":"'Methods&Limits'!I17","v":69.356999999999999}]
[{"$f":"'Methods&Limits'!A18","v":"-- Petrol with bioethanol content 6-8"},{"$f":"'Methods&Limits'!B18","v":"kPa"},{"$f":"'Methods&Limits'!E18","v":"EN 1601"},{"$f":"'Methods&Limits'!F18","v":2017},{"$f":"'Methods&Limits'!G18","v":2.2999999999999998},null,{"$f":"'Methods&Limits'!I18","v":69.236999999999995}]
[{"$f":"'Methods&Limits'!A19","v":"-- Petrol with bioethanol content 8-10"},{"$f":"'Methods&Limits'!B19","v":"kPa"},{"$f":"'Methods&Limits'!E19","v":"EN 1601"},{"$f":"'Methods&Limits'!F19","v":2017},{"$f":"'Methods&Limits'!G19","v":2.2999999999999998},null,{"$f":"'Methods&Limits'!I19","v":69.117000000000004}]
[{"$f":"'Methods&Limits'!A20","v":"--summer period (arctic or severe weather conditions)"},{"$f":"'Methods&Limits'!B20","v":"kPa"},{"$f":"'Methods&Limits'!E20","v":"EN 13016-1"},{"$f":"'Methods&Limits'!F20","v":2018},{"$f":"'Methods&Limits'!G20","v":2.2999999999999998},null,{"$f":"'Methods&Limits'!I20","v":71.356999999999999}]
[{"$f":"'Methods&Limits'!A21","v":"Distillation *"}]
[{"$f":"'Methods&Limits'!A22","v":"--evaporated at 100 oC"},{"$f":"'Methods&Limits'!B22","v":"% V/V"},{"$f":"'Methods&Limits'!E22","v":"EN-ISO 3405"},{"$f":"'Methods&Limits'!F22","v":2020},{"$f":"'Methods&Limits'!G22","v":4},{"$f":"'Methods&Limits'!H22","v":43.64},null,{"$f":"IF(D22=\"\",\"\",IF(D22<F75,\"Yes\",\"\"))","v":"Yes"}]
[{"$f":"'Methods&Limits'!A23","v":"-- evaporated at 150 oC "},{"$f":"'Methods&Limits'!B23","v":"% V/V"},{"$f":"'Methods&Limits'!E23","v":"EN-ISO 3405"},{"$f":"'Methods&Limits'!F23","v":2020},{"$f":"'Methods&Limits'!G23","v":4},{"$f":"'Methods&Limits'!H23","v":72.64},null,{"$f":"IF(D23=\"\",\"\",IF(D23<F76,\"Yes\",\"\"))","v":"Yes"}]
[{"$f":"'Methods&Limits'!A24","v":"Hydrocarbon analysis"},null,null,null,null,null,null,{"$f":"IF(D24<F77,\"Yes\",\"\")","v":""}]
[{"$f":"'Methods&Limits'!A25","v":"-- Olefins"},{"$f":"'Methods&Limits'!B25","v":"% V/V"},{"$f":"'Methods&Limits'!E25","v":"EN 15553"},{"$f":"'Methods&Limits'!F25","v":2021},{"$f":"'Methods&Limits'!G25","v":6.4},null,{"$f":"'Methods&Limits'!I25","v":21.776},{"$f":"IF($E$25>G78,\"Yes\",\"\")","v":""}]
[null,null,{"$f":"'Methods&Limits'!E26","v":"EN-ISO 22854"},{"$f":"'Methods&Limits'!F26","v":2021},{"$f":"'Methods&Limits'!G26","v":2.6},null,{"$f":"'Methods&Limits'!I26","v":19.533999999999999},{"$f":"IF($E$25>G79,\"Yes\",\"\")","v":""}]
[{"$f":"'Methods&Limits'!A27","v":"*without oxygenates"},null,{"$f":"'Methods&Limits'!E27","v":"EN 15553"},{"$f":"'Methods&Limits'!F27","v":2021},{"$f":"'Methods&Limits'!G27","v":"-"},null,{"$f":"'Methods&Limits'!I27","v":"-"},{"$f":"IF($E$25>G80,\"Yes\",\"\")","v":""}]
[null,null,{"$f":"'Methods&Limits'!E28","v":"EN-ISO 22854"},{"$f":"'Methods&Limits'!F28","v":2021},{"$f":"'Methods&Limits'!G28","v":"-"},null,{"$f":"'Methods&Limits'!I28","v":"-"},{"$f":"IF($E$25>G81,\"Yes\",\"\")","v":""}]
[{"$f":"'Methods&Limits'!A29","v":"-- Olefins (RON 91 fuel only)***"},{"$f":"'Methods&Limits'!B29","v":"% V/V"},{"$f":"'Methods&Limits'!E29","v":"ASTM D1319"},{"$f":"'Methods&Limits'!F29","v":2020},{"$f":"'Methods&Limits'!G29","v":5.0999999999999996},null,{"$f":"'Methods&Limits'!I29","v":24.009},{"$f":"IF($E$25>G82,\"Yes\",\"\")","v":""}]
[{"$f":"'Methods&Limits'!A30","v":"-- Aromatics (from 2005)"},null,{"$f":"'Methods&Limits'!E30","v":"EN-ISO 22854"},{"$f":"'Methods&Limits'!F30","v":2021},{"$f":"'Methods&Limits'!G30","v":1.7},null,{"$f":"'Methods&Limits'!I30","v":36.003},{"$f":"IF($E$26>G83,\"Yes\",\"\")","v":""}]
[{"$f":"'Methods&Limits'!A31","v":"-- Benzene"},{"$f":"'Methods&Limits'!B31","v":"% V/V"},{"$f":"'Methods&Limits'!E31","v":"EN 12177"},{"$f":"'Methods&Limits'!F31","v":2022},{"$f":"'Methods&Limits'!G31","v":0.1},null,{"$f":"'Methods&Limits'!I31","v":1.0589999999999999},{"$f":"IF(E27>G84,\"Yes\",\"\")","v":""}]
[null,null,{"$f":"'Methods&Limits'!E32","v":"EN 238"},{"$f":"'Methods&Limits'!F32","v":1996},{"$f":"'Methods&Limits'!G32","v":0.17},null,{"$f":"'Methods&Limits'!I32","v":1.1003000000000001},{"$f":"IF(E27>G85,\"Yes\",\"\")","v":""}]
[null,null,{"$f":"'Methods&Limits'!E33","v":"EN-ISO 22854"},{"$f":"'Methods&Limits'!F33","v":2021},{"$f":"'Methods&Limits'!G33","v":0.05},null,{"$f":"'Methods&Limits'!I33","v":1.0295000000000001},{"$f":"IF(E27>G86,\"Yes\",\"\")","v":""}]
[{"$f":"'Methods&Limits'!A34","v":"Oxygen content"},{"$f":"'Methods&Limits'!B34","v":"% (m/m)"},{"$f":"'Methods&Limits'!E34","v":"EN 1601"},{"$f":"'Methods&Limits'!F34","v":2017},{"$f":"'Methods&Limits'!G34","v":0.41},null,{"$f":"'Methods&Limits'!I34","v":3.9419},{"$f":"IF(E28>G87,\"Yes\",\"\")","v":""}]
[null,null,{"$f":"'Methods&Limits'!E35","v":"EN 1601"},{"$f":"'Methods&Limits'!F35","v":2017},{"$f":"'Methods&Limits'!G35","v":0.41},null,{"$f":"'Methods&Limits'!I35","v":2.9419},{"$f":"IF(E29>G88,\"Yes\",\"\")","v":""}]
[{"$f":"'Methods&Limits'!A36","v":"Oxygenates"}]
[{"$f":"'Methods&Limits'!A37","v":"-- Methanol"},{"$f":"'Methods&Limits'!B37","v":"% V/V"},{"$f":"'Methods&Limits'!E37","v":"EN 1601"},{"$f":"'Methods&Limits'!F37","v":2017},{"$f":"'Methods&Limits'!G37","v":0.3},null,{"$f":"'Methods&Limits'!I37","v":3.177},{"$f":"IF(E31>G90,\"Yes\",\"\")","v":""}]
[{"$f":"'Methods&Limits'!A38","v":"-- Ethanol"},{"$f":"'Methods&Limits'!B38","v":"% V/V"},{"$f":"'Methods&Limits'!E38","v":"EN 1601"},{"$f":"'Methods&Limits'!F38","v":2017},{"$f":"'Methods&Limits'!G38","v":0.8},null,{"$f":"'Methods&Limits'!I38","v":10.472},""]
[{"$f":"'Methods&Limits'!A39","v":"-- Iso-propyl alcohol"},{"$f":"'Methods&Limits'!B39","v":"% V/V"},{"$f":"'Methods&Limits'!E39","v":"EN 1601"},{"$f":"'Methods&Limits'!F39","v":2017},{"$f":"'Methods&Limits'!G39","v":0.9},null,{"$f":"'Methods&Limits'!I39","v":12.531000000000001},""]
[{"$f":"'Methods&Limits'!A40","v":"-- Tert-butyl alcohol"},{"$f":"'Methods&Limits'!B40","v":"% V/V"},{"$f":"'Methods&Limits'!E40","v":"EN 1601"},{"$f":"'Methods&Limits'!F40","v":2017},{"$f":"'Methods&Limits'!G40","v":1},null,{"$f":"'Methods&Limits'!I40","v":15.59},""]
[{"$f":"'Methods&Limits'!A41","v":"-- Iso-butyl alcohol"},{"$f":"'Methods&Limits'!B41","v":"% V/V"},{"$f":"'Methods&Limits'!E41","v":"EN 1601"},{"$f":"'Methods&Limits'!F41","v":2017},{"$f":"'Methods&Limits'!G41","v":1},null,{"$f":"'Methods&Limits'!I41","v":15.59},""]
[{"$f":"'Methods&Limits'!A42","v":"-- Ethers with 5 or more carbon atoms per molecule"},{"$f":"'Methods&Limits'!B42","v":"% V/V"},{"$f":"'Methods&Limits'!E42","v":"EN 1601"},{"$f":"'Methods&Limits'!F42","v":2017},{"$f":"'Methods&Limits'!G42","v":1},null,{"$f":"'Methods&Limits'!I42","v":22.59},""]
[{"$f":"'Methods&Limits'!A43","v":"-- other oxygenates"},{"$f":"'Methods&Limits'!B43","v":"% V/V"},{"$f":"'Methods&Limits'!E43","v":"EN 1601"},{"$f":"'Methods&Limits'!F43","v":2017},{"$f":"'Methods&Limits'!G43","v":1},null,{"$f":"'Methods&Limits'!I43","v":15.59},""]
[{"$f":"'Methods&Limits'!A44","v":"Oxygen content"},{"$f":"'Methods&Limits'!B44","v":"% (m/m)"},{"$f":"'Methods&Limits'!E44","v":"EN 13132"},{"$f":"'Methods&Limits'!F44","v":2002},{"$f":"'Methods&Limits'!G44","v":0.3},null,{"$f":"'Methods&Limits'!I44","v":3.8770000000000002},{"$f":"IF(E28>G97,\"Yes\",\"\")","v":""}]
[null,null,{"$f":"'Methods&Limits'!E45","v":"EN 13132"},{"$f":"'Methods&Limits'!F45","v":2002},{"$f":"'Methods&Limits'!G45","v":0.3},null,{"$f":"'Methods&Limits'!I45","v":2.8770000000000002},{"$f":"IF(E29>G98,\"Yes\",\"\")","v":""}]
[{"$f":"'Methods&Limits'!A46","v":"Oxygenates"}]
[{"$f":"'Methods&Limits'!A47","v":"-- Methanol"},{"$f":"'Methods&Limits'!B47","v":"% V/V"},{"$f":"'Methods&Limits'!E47","v":"EN 13132"},{"$f":"'Methods&Limits'!F47","v":2002},{"$f":"'Methods&Limits'!G47","v":0.3},null,{"$f":"'Methods&Limits'!I47","v":3.177},{"$f":"IF(E31>G100,\"Yes\",\"\")","v":""}]
[{"$f":"'Methods&Limits'!A48","v":"-- Ethanol"},{"$f":"'Methods&Limits'!B48","v":"% V/V"},{"$f":"'Methods&Limits'!E48","v":"EN 13132"},{"$f":"'Methods&Limits'!F48","v":2002},{"$f":"'Methods&Limits'!G48","v":0.8},null,{"$f":"'Methods&Limits'!I48","v":10.472},""]
[{"$f":"'Methods&Limits'!A49","v":"-- Iso-propyl alcohol"},{"$f":"'Methods&Limits'!B49","v":"% V/V"},{"$f":"'Methods&Limits'!E49","v":"EN 13132"},{"$f":"'Methods&Limits'!F49","v":2002},{"$f":"'Methods&Limits'!G49","v":0.8},null,{"$f":"'Methods&Limits'!I49","v":12.472},""]
[{"$f":"'Methods&Limits'!A50","v":"-- Tert-butyl alcohol"},{"$f":"'Methods&Limits'!B50","v":"% V/V"},{"$f":"'Methods&Limits'!E50","v":"EN 13132"},{"$f":"'Methods&Limits'!F50","v":2002},{"$f":"'Methods&Limits'!G50","v":1},null,{"$f":"'Methods&Limits'!I50","v":15.59},""]
[{"$f":"'Methods&Limits'!A51","v":"-- Iso-butyl alcohol"},{"$f":"'Methods&Limits'!B51","v":"% V/V"},{"$f":"'Methods&Limits'!E51","v":"EN 13132"},{"$f":"'Methods&Limits'!F51","v":2002},{"$f":"'Methods&Limits'!G51","v":1},null,{"$f":"'Methods&Limits'!I51","v":15.59},""]
[{"$f":"'Methods&Limits'!A52","v":"-- Ethers with 5 or more carbon atoms per molecule"},{"$f":"'Methods&Limits'!B52","v":"% V/V"},{"$f":"'Methods&Limits'!E52","v":"EN 13132"},{"$f":"'Methods&Limits'!F52","v":2002},{"$f":"'Methods&Limits'!G52","v":1},null,{"$f":"'Methods&Limits'!I52","v":22.59},""]
[{"$f":"'Methods&Limits'!A53","v":"-- other oxygenates"},{"$f":"'Methods&Limits'!B53","v":"% V/V"},{"$f":"'Methods&Limits'!E53","v":"EN 13132"},{"$f":"'Methods&Limits'!F53","v":2002},{"$f":"'Methods&Limits'!G53","v":1},null,{"$f":"'Methods&Limits'!I53","v":15.59},""]
[{"$f":"'Methods&Limits'!A54","v":"Oxygen content"},{"$f":"'Methods&Limits'!B54","v":"% (m/m)"},{"$f":"'Methods&Limits'!E54","v":"EN-ISO 22854"},{"$f":"'Methods&Limits'!F54","v":2021},{"$f":"'Methods&Limits'!G54","v":0.4},null,{"$f":"'Methods&Limits'!I54","v":3.9359999999999999},{"$f":"IF(E28>G107,\"Yes\",\"\")","v":""}]
[null,null,{"$f":"'Methods&Limits'!E55","v":"EN-ISO 22854"},{"$f":"'Methods&Limits'!F55","v":2021},{"$f":"'Methods&Limits'!G55","v":0.4},null,{"$f":"'Methods&Limits'!I55","v":2.9359999999999999},{"$f":"IF(E29>G108,\"Yes\",\"\")","v":""}]
[{"$f":"'Methods&Limits'!A56","v":"Oxyginates"}]
[{"$f":"'Methods&Limits'!A57","v":"-- Methanol"},{"$f":"'Methods&Limits'!B57","v":"% V/V"},{"$f":"'Methods&Limits'!E57","v":"EN-ISO 22854"},{"$f":"'Methods&Limits'!F57","v":2021},{"$f":"'Methods&Limits'!G57","v":0.4},null,{"$f":"'Methods&Limits'!I57","v":3.2359999999999998},{"$f":"IF(E31>G110,\"Yes\",\"\")","v":""}]
[{"$f":"'Methods&Limits'!A58","v":"-- Ethanol"},{"$f":"'Methods&Limits'!B58","v":"% V/V"},{"$f":"'Methods&Limits'!E58","v":"EN-ISO 22854"},{"$f":"'Methods&Limits'!F58","v":2021},{"$f":"'Methods&Limits'!G58","v":0.6},null,{"$f":"'Methods&Limits'!I58","v":10.353999999999999},""]
[{"$f":"'Methods&Limits'!A59","v":"-- Iso-propyl alcohol"},{"$f":"'Methods&Limits'!B59","v":"% V/V"},{"$f":"'Methods&Limits'!E59","v":"EN-ISO 22854"},{"$f":"'Methods&Limits'!F59","v":2021},{"$f":"'Methods&Limits'!G59","v":0.7},null,{"$f":"'Methods&Limits'!I59","v":12.413},""]
[{"$f":"'Methods&Limits'!A60","v":"-- Tert-butyl alcohol"},{"$f":"'Methods&Limits'!B60","v":"% V/V"},{"$f":"'Methods&Limits'!E60","v":"EN-ISO 22854"},{"$f":"'Methods&Limits'!F60","v":2021},{"$f":"'Methods&Limits'!G60","v":0.7},null,{"$f":"'Methods&Limits'!I60","v":15.413},""]
[{"$f":"'Methods&Limits'!A61","v":"-- Iso-butyl alcohol"},{"$f":"'Methods&Limits'!B61","v":"% V/V"},{"$f":"'Methods&Limits'!E61","v":"EN-ISO 22854"},{"$f":"'Methods&Limits'!F61","v":2021},{"$f":"'Methods&Limits'!G61","v":0.7},null,{"$f":"'Methods&Limits'!I61","v":15.413},""]
[{"$f":"'Methods&Limits'!A62","v":"-- Ethers with 5 or more carbon atoms per molecule"},{"$f":"'Methods&Limits'!B62","v":"% V/V"},{"$f":"'Methods&Limits'!E62","v":"EN-ISO 22854"},{"$f":"'Methods&Limits'!F62","v":2021},{"$f":"'Methods&Limits'!G62","v":0.9},null,{"$f":"'Methods&Limits'!I62","v":22.530999999999999},""]
[{"$f":"'Methods&Limits'!A63","v":"-- other oxygenates"},{"$f":"'Methods&Limits'!B63","v":"% V/V"},{"$f":"'Methods&Limits'!E63","v":"EN-ISO 22854"},{"$f":"'Methods&Limits'!F63","v":2021},{"$f":"'Methods&Limits'!G63","v":0.7},null,{"$f":"'Methods&Limits'!I63","v":15.413},""]
[{"$f":"'Methods&Limits'!A64:A64","v":"Sulphur content (sulphur free, from 2005)**"},{"$f":"'Methods&Limits'!B64","v":"mg/kg"},{"$f":"'Methods&Limits'!E64","v":"EN-ISO 14596"},{"$f":"'Methods&Limits'!F64","v":2018},{"$f":"'Methods&Limits'!G64","v":5},null,{"$f":"'Methods&Limits'!I64","v":12.95},{"$f":"IF(E$38>G117,\"Yes\",\"\")","v":""}]
[null,null,{"$f":"'Methods&Limits'!E65","v":"EN 24260"},{"$f":"'Methods&Limits'!F65","v":1994},{"$f":"'Methods&Limits'!G65","v":1},null,{"$f":"'Methods&Limits'!I65","v":10.59},{"$f":"IF(E$38>G118,\"Yes\",\"\")","v":""}]
[null,null,{"$f":"'Methods&Limits'!E66","v":"EN-ISO 20846"},{"$f":"'Methods&Limits'!F66","v":2019},{"$f":"'Methods&Limits'!G66","v":2.7},null,{"$f":"'Methods&Limits'!I66","v":11.593},{"$f":"IF(E$38>G119,\"Yes\",\"\")","v":""}]
[null,null,{"$f":"'Methods&Limits'!E67","v":"EN-ISO 20884"},{"$f":"'Methods&Limits'!F67","v":2019},{"$f":"'Methods&Limits'!G67","v":3.1},null,{"$f":"'Methods&Limits'!I67","v":11.829000000000001},{"$f":"IF(E$38>G120,\"Yes\",\"\")","v":""}]
[{"$f":"'Methods&Limits'!A68:A68","v":"Lead content"},{"$f":"'Methods&Limits'!B68","v":"g/l"},{"$f":"'Methods&Limits'!E68","v":"EN 237"},{"$f":"'Methods&Limits'!F68","v":2004},{"$f":"'Methods&Limits'!G68","v":6.1999999999999998E-3},null,{"$f":"'Methods&Limits'!I68","v":8.657999999999999E-3},{"$f":"IF($E$39>G121,\"Yes\",\"\")","v":""}]

{"sheet":"Petrol (7+8)","index":24,"n_rows":121,"n_cols":18,"rows_kept":121,"cut":false,"hidden":false,"merged":[[2,1,2,4],[2,6,9,16],[3,1,3,4],[4,1,4,4],[5,1,5,4],[6,1,6,4],[7,2,7,4],[13,2,14,10],[13,11,13,14],[13,15,13,16],[14,11,14,12],[14,13,14,14],[14,15,14,16],[58,2,58,8],[58,9,58,12],[20,15,22,15],[27,15,28,15],[27,16,28,16],[43,0,43,3],[44,4,45,11],[46,4,46,11],[47,4,47,11],[48,4,48,11],[49,4,49,11],[50,4,50,11],[53,0,53,11],[71,11,71,12],[59,5,59,6],[59,9,60,9],[61,11,61,12],[62,11,62,12],[63,11,63,12],[64,11,64,12],[66,11,66,12],[67,11,67,12],[68,11,68,12],[69,11,69,12],[70,11,70,12],[59,11,59,12],[85,11,85,12],[72,11,72,12],[74,11,74,12],[75,11,75,12],[77,11,77,12],[78,11,78,12],[79,11,79,12],[80,11,80,12],[81,11,81,12],[82,11,82,12],[83,11,83,12],[84,11,84,12],[99,11,99,12],[86,11,86,12],[87,11,87,12],[89,11,89,12],[90,11,90,12],[91,11,91,12],[92,11,92,12],[93,11,93,12],[94,11,94,12],[95,11,95,12],[96,11,96,12],[97,11,97,12],[112,11,112,12],[100,11,100,12],[101,11,101,12],[102,11,102,12],[103,11,103,12],[104,11,104,12],[105,11,105,12],[106,11,106,12],[107,11,107,12],[109,11,109,12],[110,11,110,12],[111,11,111,12],[119,11,119,12],[120,11,120,12],[121,11,121,12],[122,11,122,12],[113,11,113,12],[114,11,114,12],[115,11,115,12],[116,11,116,12],[117,11,117,12],[118,11,118,12]]}
["Market Fuels used in Vehicles with Spark Ignition Engines (Petrol)",null,null,null,null,null,null,null,null,null,null,null,null,null,null,null,null,"<-- GO BACK"]
[]
["Country",{"$f":"IF(LEN('Contacts&Annual Summary'!C9) > 1,'Contacts&Annual Summary'!C9,\"\")","v":""},null,null,null,null,"Notes on completing the tables\nThe table structure has been locked to prevent modification - data can be copied and pasted, in bulk into the Reporting Results blue table cells.  Where a white row exists between rows, it will not be possible to paste over white rows and sections should be pasted separately.\n\nColumn H in the Test Methods and Analysis table is set to automatically check whether the values entered in the Reporting Results table exceed maximum or minimum Tolerance Limits.  If any exceedance is detected, please provide details in the columns to the right including the number of samples, location samples were taken from, Values and Details of any action taken to address non-compliant samples.  Compliance information is verified manually and this automated compliance check is not solely relied upon during data analysis.\n\nPlease do not unlock this template - modified templates cannot be processed and may delay reporting."]
["Reporting Year",{"$f":"'Contacts&Annual Summary'!C8","v":2023}]
["Period (Summer or Winter)","Full Year"]
["Parent fuel grade","Petrol"]
["National fuel grade",{"$f":"'Petrol (7)'!B7","v":0}]
["Summer Period (N or A)*",0,{"$f":"IF( B8=\"A\",\"1st June to 31st August (arctic)\",\"1st May to 30th September (normal)\")","v":"1st May to 30th September (normal)"}]
["The maximum bioethanol content (% v/v)",{"$f":"MAX('Petrol (7)'!B9,'Petrol (8)'!B9)","v":0},"Please include the bioethanol content as a numerical figure in % V/V"]
["* N = 1st May to 30th September (normal) ; A = 1st June to 31st August (arctic)."]
[]
["Reporting results"]
[]
["Parameter","Unit","Analytical and statistical results \n(Please see an explanation and examples for new columns/ information required in Cells I15 to K37 on the Introduction & Instructions tab).",null,null,null,null,null,null,null,null,"Limiting Value (1)",null,null,null,"Test method"]
[null,null,null,null,null,null,null,null,null,null,null,"National Specification, if any",null,"According to Directive 2009/30/EC",null,"(more recent versions may also be used)"]
[null,null,"No Samples","Minimum","Maximum","Median","Mean","Standard Deviation","No Samples outside 95% tolerance limit","25% of Sample Value","75% of Sample Value","Minimum","Maximum","Minimum","Maximum","Method","Date"]
["Research Octane Number","--",{"$f":"IF(AND('Petrol (7)'!C17=\"\",'Petrol (8)'!C17=\"\"),\"\",'Petrol (7)'!C17+'Petrol (8)'!C17)","v":0},{"$f":"IF(AND('Petrol (7)'!D17=\"\",'Petrol (8)'!D17=\"\"),\"\",MIN('Petrol (7)'!D17,'Petrol (8)'!D17))","v":0},{"$f":"IF(AND('Petrol (7)'!E17=\"\",'Petrol (8)'!E17=\"\"),\"\",MAX('Petrol (7)'!E17,'Petrol (8)'!E17))","v":0},0,0,0,{"$f":"IF(AND('Petrol (7)'!I17=\"\",'Petrol (8)'!I17=\"\"),\"\",'Petrol (7)'!I17+'Petrol (8)'!I17)","v":0},0,0,null,null,"95 (2)",null,"EN-ISO 5164",2005]
["Motor Octane Number","--",{"$f":"IF(AND('Petrol (7)'!C18=\"\",'Petrol (8)'!C18=\"\"),\"\",'Petrol (7)'!C18+'Petrol (8)'!C18)","v":0},{"$f":"IF(AND('Petrol (7)'!D18=\"\",'Petrol (8)'!D18=\"\"),\"\",MIN('Petrol (7)'!D18,'Petrol (8)'!D18))","v":0},{"$f":"IF(AND('Petrol (7)'!E18=\"\",'Petrol (8)'!E18=\"\"),\"\",MAX('Petrol (7)'!E18,'Petrol (8)'!E18))","v":0},0,0,0,{"$f":"IF(AND('Petrol (7)'!I18=\"\",'Petrol (8)'!I18=\"\"),\"\",'Petrol (7)'!I18+'Petrol (8)'!I18)","v":0},0,0,null,null,"85 (3)",null,"EN-ISO 5163",2005]
["Vapour Pressure, DVPE (6)","kPa",null,null,null,null,null,null,null,null,null,null,null,null,"(4)"]
["-- required for summer period only",null,{"$f":"IF(AND('Petrol (7)'!C20=\"\",'Petrol (8)'!C20=\"\"),\"\",'Petrol (7)'!C20+'Petrol (8)'!C20)","v":0},{"$f":"IF(AND('Petrol (7)'!D20=\"\",'Petrol (8)'!D20=\"\"),\"\",MIN('Petrol (7)'!D20,'Petrol (8)'!D20))","v":0},{"$f":"IF(AND('Petrol (7)'!E20=\"\",'Petrol (8)'!E20=\"\"),\"\",MAX('Petrol (7)'!E20,'Petrol (8)'!E20))","v":0},0,0,0,{"$f":"IF(AND('Petrol (7)'!I20=\"\",'Petrol (8)'!I20=\"\"),\"\",'Petrol (7)'!I20+'Petrol (8)'!I20)","v":0},0,0,null,null,null,{"$f":"IF(E8=\"A\",70,60)","v":60},"EN 13106-1",2007]
["Distillation",null,null,null,null,null,null,null,null,null,null,null,null,null,null,"EN-ISO 3405"]
["-- evaporated at 100 oC","% V/V",{"$f":"IF(AND('Petrol (7)'!C22=\"\",'Petrol (8)'!C22=\"\"),\"\",'Petrol (7)'!C22+'Petrol (8)'!C22)","v":0},{"$f":"IF(AND('Petrol (7)'!D22=\"\",'Petrol (8)'!D22=\"\"),\"\",MIN('Petrol (7)'!D22,'Petrol (8)'!D22))","v":0},{"$f":"IF(AND('Petrol (7)'!E22=\"\",'Petrol (8)'!E22=\"\"),\"\",MAX('Petrol (7)'!E22,'Petrol (8)'!E22))","v":0},0,0,0,{"$f":"IF(AND('Petrol (7)'!I22=\"\",'Petrol (8)'!I22=\"\"),\"\",'Petrol (7)'!I22+'Petrol (8)'!I22)","v":0},0,0,null,null,46,null,null,2000]
["-- evaporated at 150 oC ","% V/V",{"$f":"IF(AND('Petrol (7)'!C23=\"\",'Petrol (8)'!C23=\"\"),\"\",'Petrol (7)'!C23+'Petrol (8)'!C23)","v":0},{"$f":"IF(AND('Petrol (7)'!D23=\"\",'Petrol (8)'!D23=\"\"),\"\",MIN('Petrol (7)'!D23,'Petrol (8)'!D23))","v":0},{"$f":"IF(AND('Petrol (7)'!E23=\"\",'Petrol (8)'!E23=\"\"),\"\",MAX('Petrol (7)'!E23,'Petrol (8)'!E23))","v":0},0,0,0,{"$f":"IF(AND('Petrol (7)'!I23=\"\",'Petrol (8)'!I23=\"\"),\"\",'Petrol (7)'!I23+'Petrol (8)'!I23)","v":0},0,0,null,null,75]
["Hydrocarbon analysis"]
["-- Olefins","% V/V",{"$f":"IF(AND('Petrol (7)'!C25=\"\",'Petrol (8)'!C25=\"\"),\"\",'Petrol (7)'!C25+'Petrol (8)'!C25)","v":0},{"$f":"IF(AND('Petrol (7)'!D25=\"\",'Petrol (8)'!D25=\"\"),\"\",MIN('Petrol (7)'!D25,'Petrol (8)'!D25))","v":0},{"$f":"IF(AND('Petrol (7)'!E25=\"\",'Petrol (8)'!E25=\"\"),\"\",MAX('Petrol (7)'!E25,'Petrol (8)'!E25))","v":0},0,0,0,{"$f":"IF(AND('Petrol (7)'!I25=\"\",'Petrol (8)'!I25=\"\"),\"\",'Petrol (7)'!I25+'Petrol (8)'!I25)","v":0},0,0,null,null,null,"18.0 (5)","ASTM D 1319\nEN 15553\nEN-ISO 22854","1995\n2007\n2008"]
["-- Aromatics","% V/V",{"$f":"IF(AND('Petrol (7)'!C26=\"\",'Petrol (8)'!C26=\"\"),\"\",'Petrol (7)'!C26+'Petrol (8)'!C26)","v":0},{"$f":"IF(AND('Petrol (7)'!D26=\"\",'Petrol (8)'!D26=\"\"),\"\",MIN('Petrol (7)'!D26,'Petrol (8)'!D26))","v":0},{"$f":"IF(AND('Petrol (7)'!E26=\"\",'Petrol (8)'!E26=\"\"),\"\",MAX('Petrol (7)'!E26,'Petrol (8)'!E26))","v":0},0,0,0,{"$f":"IF(AND('Petrol (7)'!I26=\"\",'Petrol (8)'!I26=\"\"),\"\",'Petrol (7)'!I26+'Petrol (8)'!I26)","v":0},0,0,null,null,null,35,"EN-ISO 22854","1995\n2008"]
["-- Benzene","% V/V",{"$f":"IF(AND('Petrol (7)'!C27=\"\",'Petrol (8)'!C27=\"\"),\"\",'Petrol (7)'!C27+'Petrol (8)'!C27)","v":0},{"$f":"IF(AND('Petrol (7)'!D27=\"\",'Petrol (8)'!D27=\"\"),\"\",MIN('Petrol (7)'!D27,'Petrol (8)'!D27))","v":0},{"$f":"IF(AND('Petrol (7)'!E27=\"\",'Petrol (8)'!E27=\"\"),\"\",MAX('Petrol (7)'!E27,'Petrol (8)'!E27))","v":0},0,0,0,{"$f":"IF(AND('Petrol (7)'!I27=\"\",'Petrol (8)'!I27=\"\"),\"\",'Petrol (7)'!I27+'Petrol (8)'!I27)","v":0},0,0,null,null,null,1,"EN 238\nEN 12177\nEN-ISO 22854","1996\n1998\n2008"]
[{"$f":"IF(C29>0,\"Do not complete\",\"Oxygen content\")","v":"Oxygen content"},"% (m/m)",{"$f":"IF(AND('Petrol (7)'!C28=\"\",'Petrol (8)'!C28=\"\"),\"\",'Petrol (7)'!C28+'Petrol (8)'!C28)","v":0},{"$f":"IF(AND('Petrol (7)'!D28=\"\",'Petrol (8)'!D28=\"\"),\"\",MIN('Petrol (7)'!D28,'Petrol (8)'!D28))","v":0},{"$f":"IF(AND('Petrol (7)'!E28=\"\",'Petrol (8)'!E28=\"\"),\"\",MAX('Petrol (7)'!E28,'Petrol (8)'!E28))","v":0},0,0,0,{"$f":"IF(AND('Petrol (7)'!I28=\"\",'Petrol (8)'!I28=\"\"),\"\",'Petrol (7)'!I28+'Petrol (8)'!I28)","v":0},0,0,null,null,null,3.7,"EN 1601\nEN 13132\nEN-ISO 22854","1997\n2000\n2008"]
[{"$f":"IF(C28>0,\"Do not complete\",\"Oxygen content*\n*petrol with 5% (v/v) or less ethanol content\")","v":"Oxygen content*\n*petrol with 5% (v/v) or less ethanol content"},"% (m/m)",{"$f":"IF(AND('Petrol (7)'!C29=\"\",'Petrol (8)'!C29=\"\"),\"\",'Petrol (7)'!C29+'Petrol (8)'!C29)","v":0},{"$f":"IF(AND('Petrol (7)'!D29=\"\",'Petrol (8)'!D29=\"\"),\"\",MIN('Petrol (7)'!D29,'Petrol (8)'!D29))","v":0},{"$f":"IF(AND('Petrol (7)'!E29=\"\",'Petrol (8)'!E29=\"\"),\"\",MAX('Petrol (7)'!E29,'Petrol (8)'!E29))","v":0},0,0,0,{"$f":"IF(AND('Petrol (7)'!I29=\"\",'Petrol (8)'!I29=\"\"),\"\",'Petrol (7)'!I29+'Petrol (8)'!I29)","v":0},0,0,null,null,null,2.7]
["Oxygenates"]
["-- Methanol","% V/V",{"$f":"IF(AND('Petrol (7)'!C31=\"\",'Petrol (8)'!C31=\"\"),\"\",'Petrol (7)'!C31+'Petrol (8)'!C31)","v":0},{"$f":"IF(AND('Petrol (7)'!D31=\"\",'Petrol (8)'!D31=\"\"),\"\",MIN('Petrol (7)'!D31,'Petrol (8)'!D31))","v":0},{"$f":"IF(AND('Petrol (7)'!E31=\"\",'Petrol (8)'!E31=\"\"),\"\",MAX('Petrol (7)'!E31,'Petrol (8)'!E31))","v":0},0,0,0,{"$f":"IF(AND('Petrol (7)'!I31=\"\",'Petrol (8)'!I31=\"\"),\"\",'Petrol (7)'!I31+'Petrol (8)'!I31)","v":0},0,0,null,null,null,3]
["-- Ethanol","% V/V",{"$f":"IF(AND('Petrol (7)'!C32=\"\",'Petrol (8)'!C32=\"\"),\"\",'Petrol (7)'!C32+'Petrol (8)'!C32)","v":0},{"$f":"IF(AND('Petrol (7)'!D32=\"\",'Petrol (8)'!D32=\"\"),\"\",MIN('Petrol (7)'!D32,'Petrol (8)'!D32))","v":0},{"$f":"IF(AND('Petrol (7)'!E32=\"\",'Petrol (8)'!E32=\"\"),\"\",MAX('Petrol (7)'!E32,'Petrol (8)'!E32))","v":0},0,0,0,{"$f":"IF(AND('Petrol (7)'!I32=\"\",'Petrol (8)'!I32=\"\"),\"\",'Petrol (7)'!I32+'Petrol (8)'!I32)","v":0},0,0,null,null,null,10]
["-- Iso-propyl alcohol","% V/V",{"$f":"IF(AND('Petrol (7)'!C33=\"\",'Petrol (8)'!C33=\"\"),\"\",'Petrol (7)'!C33+'Petrol (8)'!C33)","v":0},{"$f":"IF(AND('Petrol (7)'!D33=\"\",'Petrol (8)'!D33=\"\"),\"\",MIN('Petrol (7)'!D33,'Petrol (8)'!D33))","v":0},{"$f":"IF(AND('Petrol (7)'!E33=\"\",'Petrol (8)'!E33=\"\"),\"\",MAX('Petrol (7)'!E33,'Petrol (8)'!E33))","v":0},0,0,0,{"$f":"IF(AND('Petrol (7)'!I33=\"\",'Petrol (8)'!I33=\"\"),\"\",'Petrol (7)'!I33+'Petrol (8)'!I33)","v":0},0,0,null,null,null,12,"EN 1601",1997]
["-- Tert-butyl alcohol","% V/V",{"$f":"IF(AND('Petrol (7)'!C34=\"\",'Petrol (8)'!C34=\"\"),\"\",'Petrol (7)'!C34+'Petrol (8)'!C34)","v":0},{"$f":"IF(AND('Petrol (7)'!D34=\"\",'Petrol (8)'!D34=\"\"),\"\",MIN('Petrol (7)'!D34,'Petrol (8)'!D34))","v":0},{"$f":"IF(AND('Petrol (7)'!E34=\"\",'Petrol (8)'!E34=\"\"),\"\",MAX('Petrol (7)'!E34,'Petrol (8)'!E34))","v":0},0,0,0,{"$f":"IF(AND('Petrol (7)'!I34=\"\",'Petrol (8)'!I34=\"\"),\"\",'Petrol (7)'!I34+'Petrol (8)'!I34)","v":0},0,0,null,null,null,15,"EN 13132",2000]
["-- Iso-butyl alcohol","% V/V",{"$f":"IF(AND('Petrol (7)'!C35=\"\",'Petrol (8)'!C35=\"\"),\"\",'Petrol (7)'!C35+'Petrol (8)'!C35)","v":0},{"$f":"IF(AND('Petrol (7)'!D35=\"\",'Petrol (8)'!D35=\"\"),\"\",MIN('Petrol (7)'!D35,'Petrol (8)'!D35))","v":0},{"$f":"IF(AND('Petrol (7)'!E35=\"\",'Petrol (8)'!E35=\"\"),\"\",MAX('Petrol (7)'!E35,'Petrol (8)'!E35))","v":0},0,0,0,{"$f":"IF(AND('Petrol (7)'!I35=\"\",'Petrol (8)'!I35=\"\"),\"\",'Petrol (7)'!I35+'Petrol (8)'!I35)","v":0},0,0,null,null,null,15,"EN-ISO 22854",2008]
["-- Ethers with ≥5 carbon atoms / molecule","% V/V",{"$f":"IF(AND('Petrol (7)'!C36=\"\",'Petrol (8)'!C36=\"\"),\"\",'Petrol (7)'!C36+'Petrol (8)'!C36)","v":0},{"$f":"IF(AND('Petrol (7)'!D36=\"\",'Petrol (8)'!D36=\"\"),\"\",MIN('Petrol (7)'!D36,'Petrol (8)'!D36))","v":0},{"$f":"IF(AND('Petrol (7)'!E36=\"\",'Petrol (8)'!E36=\"\"),\"\",MAX('Petrol (7)'!E36,'Petrol (8)'!E36))","v":0},0,0,0,{"$f":"IF(AND('Petrol (7)'!I36=\"\",'Petrol (8)'!I36=\"\"),\"\",'Petrol (7)'!I36+'Petrol (8)'!I36)","v":0},0,0,null,null,null,22]
["-- other oxygenates","% V/V",{"$f":"IF(AND('Petrol (7)'!C37=\"\",'Petrol (8)'!C37=\"\"),\"\",'Petrol (7)'!C37+'Petrol (8)'!C37)","v":0},{"$f":"IF(AND('Petrol (7)'!D37=\"\",'Petrol (8)'!D37=\"\"),\"\",MIN('Petrol (7)'!D37,'Petrol (8)'!D37))","v":0},{"$f":"IF(AND('Petrol (7)'!E37=\"\",'Petrol (8)'!E37=\"\"),\"\",MAX('Petrol (7)'!E37,'Petrol (8)'!E37))","v":0},0,0,0,{"$f":"IF(AND('Petrol (7)'!I37=\"\",'Petrol (8)'!I37=\"\"),\"\",'Petrol (7)'!I37+'Petrol (8)'!I37)","v":0},0,0,null,null,null,15]
["Sulphur content","mg/kg",{"$f":"IF(AND('Petrol (7)'!C38=\"\",'Petrol (8)'!C38=\"\"),\"\",'Petrol (7)'!C38+'Petrol (8)'!C38)","v":0},{"$f":"IF(AND('Petrol (7)'!D38=\"\",'Petrol (8)'!D38=\"\"),\"\",MIN('Petrol (7)'!D38,'Petrol (8)'!D38))","v":0},{"$f":"IF(AND('Petrol (7)'!E38=\"\",'Petrol (8)'!E38=\"\"),\"\",MAX('Petrol (7)'!E38,'Petrol (8)'!E38))","v":0},0,0,0,{"$f":"IF(AND('Petrol (7)'!I38=\"\",'Petrol (8)'!I38=\"\"),\"\",'Petrol (7)'!I38+'Petrol (8)'!I38)","v":0},0,0,null,null,null,10,"EN-ISO 14596\nEN 24260\nEN-ISO 20846\nEN-ISO 20884","1998\n1994\n2004\n2004"]
["Lead content","g/l",{"$f":"IF(AND('Petrol (7)'!C39=\"\",'Petrol (8)'!C39=\"\"),\"\",'Petrol (7)'!C39+'Petrol (8)'!C39)","v":0},{"$f":"IF(AND('Petrol (7)'!D39=\"\",'Petrol (8)'!D39=\"\"),\"\",MIN('Petrol (7)'!D39,'Petrol (8)'!D39))","v":0},{"$f":"IF(AND('Petrol (7)'!E39=\"\",'Petrol (8)'!E39=\"\"),\"\",MAX('Petrol (7)'!E39,'Petrol (8)'!E39))","v":0},0,0,0,{"$f":"IF(AND('Petrol (7)'!I39=\"\",'Petrol (8)'!I39=\"\"),\"\",'Petrol (7)'!I39+'Petrol (8)'!I39)","v":0},0,0,null,null,null,5.0000000000000001E-3,"EN 237",1996]
[]
[]
["Sampling frequency"]
[]
["Number of samples in month"]
["January",{"$f":"'Petrol (7)'!B45+'Petrol (8)'!B45","v":0},"July",{"$f":"'Petrol (7)'!D45+'Petrol (8)'!D45","v":0},"(1) The limiting values are \"true values\" and were established according to the procedures for limit setting in EN 228:2008  The results of individual measurements shall be interpreted following the criteria described in EN 228:2008."]
["February",{"$f":"'Petrol (7)'!B46+'Petrol (8)'!B46","v":0},"August",{"$f":"'Petrol (7)'!D46+'Petrol (8)'!D46","v":0}]
["March",{"$f":"'Petrol (7)'!B47+'Petrol (8)'!B47","v":0},"September",{"$f":"'Petrol (7)'!D47+'Petrol (8)'!D47","v":0},"(2) 91 for unleaded regular grade petrol: See 2009/30/EC Annex I, Footnote 3."]
["April",{"$f":"'Petrol (7)'!B48+'Petrol (8)'!B48","v":0},"October",{"$f":"'Petrol (7)'!D48+'Petrol (8)'!D48","v":0},"(3) 81 for unleaded regular grade petrol: See 2009/30/EC Annex I, Footnote 3."]
["May",{"$f":"'Petrol (7)'!B49+'Petrol (8)'!B49","v":0},"November",{"$f":"'Petrol (7)'!D49+'Petrol (8)'!D49","v":0},"(4) 70 kPa for Member States with arctic or severe weather conditions: See 2003/30/EC Annex I, Footnotes 4 & 5."]
["June",{"$f":"'Petrol (7)'!B50+'Petrol (8)'!B50","v":0},"December",{"$f":"'Petrol (7)'!D50+'Petrol (8)'!D50","v":0},"(5) 21 for unleaded regular grade petrol: See 98/70/EC, Annex I, Footnote 6."]
[null,null,"Full YearTotal",{"$f":"SUM(B45:B50,D45:D50)","v":0},"(6) Vapour pressure waiver applies for petrol containing Bioethanol, see 2009/30/EC Annex I, Footnote 5 and Annex III."]
[]
["Other notes (optional):"]
[]
[]
[]
["Test Methods and Analysis",null,null,null,null,null,null,null,"Only if not provided in Summer and Winter sheets"]
[]
["Parameter","Unit","Test specified in 2009/30/EC or EN228:2008",null,null,null,null,null,null,"Notes on exceedences"]
[null,null,"Method","Date","Reproducability, R","Tolerance limits",null,null,null,"Sample location (S,T or R)","Values","Details/action taken"]
[null,null,null,null,null,"Minimum","Maximum","Exceeded?"]
[{"$f":"'Methods&Limits'!A9","v":"Research Octane Number (RON)"},{"$f":"'Methods&Limits'!B9","v":"--"},{"$f":"'Methods&Limits'!E9","v":"EN-ISO 5164"},{"$f":"'Methods&Limits'!F9","v":2014},{"$f":"'Methods&Limits'!G9","v":0.7},{"$f":"'Methods&Limits'!H9","v":94.587000000000003},null,{"$f":"IF(D17=\"\",\"\",IF(D17<F62,\"Yes\",\"\"))","v":"Yes"}]
[{"$f":"'Methods&Limits'!A10","v":"(RON 91 fuel only)"},{"$f":"'Methods&Limits'!B10","v":"--"},{"$f":"'Methods&Limits'!E10","v":"EN-ISO 5164"},{"$f":"'Methods&Limits'!F10","v":2014},{"$f":"'Methods&Limits'!G10","v":0.7},{"$f":"'Methods&Limits'!H10","v":90.587000000000003},null,{"$f":"IF(D17=\"\",\"\",IF(D17<F63,\"Yes\",\"\"))","v":"Yes"}]
[{"$f":"'Methods&Limits'!A11","v":"Motor Octane Number (MON)"},{"$f":"'Methods&Limits'!B11","v":"--"},{"$f":"'Methods&Limits'!E11","v":"EN-ISO 5163"},{"$f":"'Methods&Limits'!F11","v":2014},{"$f":"'Methods&Limits'!G11","v":0.9},{"$f":"'Methods&Limits'!H11","v":84.468999999999994},null,{"$f":"IF(D18=\"\",\"\",IF(D18<F64,\"Yes\",\"\"))","v":"Yes"}]
[{"$f":"'Methods&Limits'!A12","v":"(RON 91 fuel only)"},{"$f":"'Methods&Limits'!B12","v":"--"},{"$f":"'Methods&Limits'!E12","v":"EN-ISO 5163"},{"$f":"'Methods&Limits'!F12","v":2014},{"$f":"'Methods&Limits'!G12","v":0.9},{"$f":"'Methods&Limits'!H12","v":80.468999999999994},null,{"$f":"IF(D18=\"\",\"\",IF(D18<F65,\"Yes\",\"\"))","v":"Yes"}]
[{"$f":"'Methods&Limits'!A13","v":"Vapour Pressure, DVPE"}]
[{"$f":"'Methods&Limits'!A14","v":"--summer period (normal)"},{"$f":"'Methods&Limits'!B14","v":"kPa"},{"$f":"'Methods&Limits'!E14","v":"EN 13016-1"},{"$f":"'Methods&Limits'!F14","v":2018},{"$f":"'Methods&Limits'!G14","v":2.2000000000000002},null,{"$f":"'Methods&Limits'!I14","v":61.298000000000002},{"$f":"IF(E$20=\"\",\"\",IF(E$20>G67,\"Yes\",\"\"))","v":""}]
[{"$f":"'Methods&Limits'!A15","v":"-- Petrol with bioethanol content 0-2"},{"$f":"'Methods&Limits'!B15","v":"kPa"},{"$f":"'Methods&Limits'!E15","v":"EN 1601"},{"$f":"'Methods&Limits'!F15","v":2017},{"$f":"'Methods&Limits'!G15","v":2.2999999999999998},null,{"$f":"'Methods&Limits'!I15","v":67.307000000000002},{"$f":"IF(E$20=\"\",\"\",IF(E$20>G68,\"Yes\",\"\"))","v":""}]
[{"$f":"'Methods&Limits'!A16","v":"-- Petrol with bioethanol content 2-4"},{"$f":"'Methods&Limits'!B16","v":"kPa"},{"$f":"'Methods&Limits'!E16","v":"EN 1601"},{"$f":"'Methods&Limits'!F16","v":2017},{"$f":"'Methods&Limits'!G16","v":2.2999999999999998},null,{"$f":"'Methods&Limits'!I16","v":69.156999999999996},""]
[{"$f":"'Methods&Limits'!A17","v":"-- Petrol with bioethanol content 4-6"},{"$f":"'Methods&Limits'!B17","v":"kPa"},{"$f":"'Methods&Limits'!E17","v":"EN 1601"},{"$f":"'Methods&Limits'!F17","v":2017},{"$f":"'Methods&Limits'!G17","v":2.2999999999999998},null,{"$f":"'Methods&Limits'!I17","v":69.356999999999999},""]
[{"$f":"'Methods&Limits'!A18","v":"-- Petrol with bioethanol content 6-8"},{"$f":"'Methods&Limits'!B18","v":"kPa"},{"$f":"'Methods&Limits'!E18","v":"EN 1601"},{"$f":"'Methods&Limits'!F18","v":2017},{"$f":"'Methods&Limits'!G18","v":2.2999999999999998},null,{"$f":"'Methods&Limits'!I18","v":69.236999999999995},""]
[{"$f":"'Methods&Limits'!A19","v":"-- Petrol with bioethanol content 8-10"},{"$f":"'Methods&Limits'!B19","v":"kPa"},{"$f":"'Methods&Limits'!E19","v":"EN 1601"},{"$f":"'Methods&Limits'!F19","v":2017},{"$f":"'Methods&Limits'!G19","v":2.2999999999999998},null,{"$f":"'Methods&Limits'!I19","v":69.117000000000004},""]
[{"$f":"'Methods&Limits'!A20","v":"--summer period (arctic or severe weather conditions)"},{"$f":"'Methods&Limits'!B20","v":"kPa"},{"$f":"'Methods&Limits'!E20","v":"EN 13016-1"},{"$f":"'Methods&Limits'!F20","v":2018},{"$f":"'Methods&Limits'!G20","v":2.2999999999999998},null,{"$f":"'Methods&Limits'!I20","v":71.356999999999999},""]
[{"$f":"'Methods&Limits'!A21","v":"Distillation *"}]
[{"$f":"'Methods&Limits'!A22","v":"--evaporated at 100 oC"},{"$f":"'Methods&Limits'!B22","v":"% V/V"},{"$f":"'Methods&Limits'!E22","v":"EN-ISO 3405"},{"$f":"'Methods&Limits'!F22","v":2020},{"$f":"'Methods&Limits'!G22","v":4},{"$f":"'Methods&Limits'!H22","v":43.64},null,{"$f":"IF(D22=\"\",\"\",IF(D22<F75,\"Yes\",\"\"))","v":"Yes"}]
[{"$f":"'Methods&Limits'!A23","v":"-- evaporated at 150 oC "},{"$f":"'Methods&Limits'!B23","v":"% V/V"},{"$f":"'Methods&Limits'!E23","v":"EN-ISO 3405"},{"$f":"'Methods&Limits'!F23","v":2020},{"$f":"'Methods&Limits'!G23","v":4},{"$f":"'Methods&Limits'!H23","v":72.64},null,{"$f":"IF(D23=\"\",\"\",IF(D23<F76,\"Yes\",\"\"))","v":"Yes"}]
[{"$f":"'Methods&Limits'!A24","v":"Hydrocarbon analysis"},null,null,null,null,null,null,{"$f":"IF(D24<F77,\"Yes\",\"\")","v":""}]
[{"$f":"'Methods&Limits'!A25","v":"-- Olefins"},{"$f":"'Methods&Limits'!B25","v":"% V/V"},{"$f":"'Methods&Limits'!E25","v":"EN 15553"},{"$f":"'Methods&Limits'!F25","v":2021},{"$f":"'Methods&Limits'!G25","v":6.4},null,{"$f":"'Methods&Limits'!I25","v":21.776},{"$f":"IF(E$25=\"\",\"\",IF(E$25>G78,\"Yes\",\"\"))","v":""}]
[null,null,{"$f":"'Methods&Limits'!E26","v":"EN-ISO 22854"},{"$f":"'Methods&Limits'!F26","v":2021},{"$f":"'Methods&Limits'!G26","v":2.6},null,{"$f":"'Methods&Limits'!I26","v":19.533999999999999},{"$f":"IF(E$25=\"\",\"\",IF(E$25>G79,\"Yes\",\"\"))","v":""}]
[{"$f":"'Methods&Limits'!A27","v":"*without oxygenates"},null,{"$f":"'Methods&Limits'!E27","v":"EN 15553"},{"$f":"'Methods&Limits'!F27","v":2021},{"$f":"'Methods&Limits'!G27","v":"-"},null,{"$f":"'Methods&Limits'!I27","v":"-"},{"$f":"IF(E$25=\"\",\"\",IF(E$25>G80,\"Yes\",\"\"))","v":""}]
[null,null,{"$f":"'Methods&Limits'!E28","v":"EN-ISO 22854"},{"$f":"'Methods&Limits'!F28","v":2021},{"$f":"'Methods&Limits'!G28","v":"-"},null,{"$f":"'Methods&Limits'!I28","v":"-"},{"$f":"IF(E$25=\"\",\"\",IF(E$25>G81,\"Yes\",\"\"))","v":""}]
[{"$f":"'Methods&Limits'!A29","v":"-- Olefins (RON 91 fuel only)***"},{"$f":"'Methods&Limits'!B29","v":"% V/V"},{"$f":"'Methods&Limits'!E29","v":"ASTM D1319"},{"$f":"'Methods&Limits'!F29","v":2020},{"$f":"'Methods&Limits'!G29","v":5.0999999999999996},null,{"$f":"'Methods&Limits'!I29","v":24.009},{"$f":"IF(E$25=\"\",\"\",IF(E$25>G82,\"Yes\",\"\"))","v":""}]
[{"$f":"'Methods&Limits'!A30","v":"-- Aromatics (from 2005)"},null,{"$f":"'Methods&Limits'!E30","v":"EN-ISO 22854"},{"$f":"'Methods&Limits'!F30","v":2021},{"$f":"'Methods&Limits'!G30","v":1.7},null,{"$f":"'Methods&Limits'!I30","v":36.003},{"$f":"IF(E$26=\"\",\"\",IF(E$26>G83,\"Yes\",\"\"))","v":""}]
[{"$f":"'Methods&Limits'!A31","v":"-- Benzene"},{"$f":"'Methods&Limits'!B31","v":"% V/V"},{"$f":"'Methods&Limits'!E31","v":"EN 12177"},{"$f":"'Methods&Limits'!F31","v":2022},{"$f":"'Methods&Limits'!G31","v":0.1},null,{"$f":"'Methods&Limits'!I31","v":1.0589999999999999},{"$f":"IF(E$27=\"\",\"\",IF(E$27>G84,\"Yes\",\"\"))","v":""}]
[null,null,{"$f":"'Methods&Limits'!E32","v":"EN 238"},{"$f":"'Methods&Limits'!F32","v":1996},{"$f":"'Methods&Limits'!G32","v":0.17},null,{"$f":"'Methods&Limits'!I32","v":1.1003000000000001},{"$f":"IF(E$27=\"\",\"\",IF(E$27>G85,\"Yes\",\"\"))","v":""}]
[null,null,{"$f":"'Methods&Limits'!E33","v":"EN-ISO 22854"},{"$f":"'Methods&Limits'!F33","v":2021},{"$f":"'Methods&Limits'!G33","v":0.05},null,{"$f":"'Methods&Limits'!I33","v":1.0295000000000001},{"$f":"IF(E$27=\"\",\"\",IF(E$27>G86,\"Yes\",\"\"))","v":""}]
[{"$f":"'Methods&Limits'!A34","v":"Oxygen content"},{"$f":"'Methods&Limits'!B34","v":"% (m/m)"},{"$f":"'Methods&Limits'!E34","v":"EN 1601"},{"$f":"'Methods&Limits'!F34","v":2017},{"$f":"'Methods&Limits'!G34","v":0.41},null,{"$f":"'Methods&Limits'!I34","v":3.9419},{"$f":"IF(E$27=\"\",\"\",IF(E$27>G87,\"Yes\",\"\"))","v":""}]
[null,null,{"$f":"'Methods&Limits'!E35","v":"EN 1601"},{"$f":"'Methods&Limits'!F35","v":2017},{"$f":"'Methods&Limits'!G35","v":0.41},null,{"$f":"'Methods&Limits'!I35","v":2.9419},{"$f":"IF(E$27=\"\",\"\",IF(E$27>G88,\"Yes\",\"\"))","v":""}]
[{"$f":"'Methods&Limits'!A36","v":"Oxygenates"}]
[{"$f":"'Methods&Limits'!A37","v":"-- Methanol"},{"$f":"'Methods&Limits'!B37","v":"% V/V"},{"$f":"'Methods&Limits'!E37","v":"EN 1601"},{"$f":"'Methods&Limits'!F37","v":2017},{"$f":"'Methods&Limits'!G37","v":0.3},null,{"$f":"'Methods&Limits'!I37","v":3.177},{"$f":"IF(E31=\"\",\"\",IF(E31>G90,\"Yes\",\"\"))","v":""}]
[{"$f":"'Methods&Limits'!A38","v":"-- Ethanol"},{"$f":"'Methods&Limits'!B38","v":"% V/V"},{"$f":"'Methods&Limits'!E38","v":"EN 1601"},{"$f":"'Methods&Limits'!F38","v":2017},{"$f":"'Methods&Limits'!G38","v":0.8},null,{"$f":"'Methods&Limits'!I38","v":10.472},""]
[{"$f":"'Methods&Limits'!A39","v":"-- Iso-propyl alcohol"},{"$f":"'Methods&Limits'!B39","v":"% V/V"},{"$f":"'Methods&Limits'!E39","v":"EN 1601"},{"$f":"'Methods&Limits'!F39","v":2017},{"$f":"'Methods&Limits'!G39","v":0.9},null,{"$f":"'Methods&Limits'!I39","v":12.531000000000001},""]
[{"$f":"'Methods&Limits'!A40","v":"-- Tert-butyl alcohol"},{"$f":"'Methods&Limits'!B40","v":"% V/V"},{"$f":"'Methods&Limits'!E40","v":"EN 1601"},{"$f":"'Methods&Limits'!F40","v":2017},{"$f":"'Methods&Limits'!G40","v":1},null,{"$f":"'Methods&Limits'!I40","v":15.59},""]
[{"$f":"'Methods&Limits'!A41","v":"-- Iso-butyl alcohol"},{"$f":"'Methods&Limits'!B41","v":"% V/V"},{"$f":"'Methods&Limits'!E41","v":"EN 1601"},{"$f":"'Methods&Limits'!F41","v":2017},{"$f":"'Methods&Limits'!G41","v":1},null,{"$f":"'Methods&Limits'!I41","v":15.59},""]
[{"$f":"'Methods&Limits'!A42","v":"-- Ethers with 5 or more carbon atoms per molecule"},{"$f":"'Methods&Limits'!B42","v":"% V/V"},{"$f":"'Methods&Limits'!E42","v":"EN 1601"},{"$f":"'Methods&Limits'!F42","v":2017},{"$f":"'Methods&Limits'!G42","v":1},null,{"$f":"'Methods&Limits'!I42","v":22.59},""]
[{"$f":"'Methods&Limits'!A43","v":"-- other oxygenates"},{"$f":"'Methods&Limits'!B43","v":"% V/V"},{"$f":"'Methods&Limits'!E43","v":"EN 1601"},{"$f":"'Methods&Limits'!F43","v":2017},{"$f":"'Methods&Limits'!G43","v":1},null,{"$f":"'Methods&Limits'!I43","v":15.59},""]
[{"$f":"'Methods&Limits'!A44","v":"Oxygen content"},{"$f":"'Methods&Limits'!B44","v":"% (m/m)"},{"$f":"'Methods&Limits'!E44","v":"EN 13132"},{"$f":"'Methods&Limits'!F44","v":2002},{"$f":"'Methods&Limits'!G44","v":0.3},null,{"$f":"'Methods&Limits'!I44","v":3.8770000000000002},{"$f":"IF(E28=\"\",\"\",IF(E28>G97,\"Yes\",\"\"))","v":""}]
[null,null,{"$f":"'Methods&Limits'!E45","v":"EN 13132"},{"$f":"'Methods&Limits'!F45","v":2002},{"$f":"'Methods&Limits'!G45","v":0.3},null,{"$f":"'Methods&Limits'!I45","v":2.8770000000000002},{"$f":"IF(E29=\"\",\"\",IF(E29>G98,\"Yes\",\"\"))","v":""}]
[{"$f":"'Methods&Limits'!A46","v":"Oxygenates"}]
[{"$f":"'Methods&Limits'!A47","v":"-- Methanol"},{"$f":"'Methods&Limits'!B47","v":"% V/V"},{"$f":"'Methods&Limits'!E47","v":"EN 13132"},{"$f":"'Methods&Limits'!F47","v":2002},{"$f":"'Methods&Limits'!G47","v":0.3},null,{"$f":"'Methods&Limits'!I47","v":3.177},{"$f":"IF(E31=\"\",\"\",IF(E31>G100,\"Yes\",\"\"))","v":""}]
[{"$f":"'Methods&Limits'!A48","v":"-- Ethanol"},{"$f":"'Methods&Limits'!B48","v":"% V/V"},{"$f":"'Methods&Limits'!E48","v":"EN 13132"},{"$f":"'Methods&Limits'!F48","v":2002},{"$f":"'Methods&Limits'!G48","v":0.8},null,{"$f":"'Methods&Limits'!I48","v":10.472},""]
[{"$f":"'Methods&Limits'!A49","v":"-- Iso-propyl alcohol"},{"$f":"'Methods&Limits'!B49","v":"% V/V"},{"$f":"'Methods&Limits'!E49","v":"EN 13132"},{"$f":"'Methods&Limits'!F49","v":2002},{"$f":"'Methods&Limits'!G49","v":0.8},null,{"$f":"'Methods&Limits'!I49","v":12.472},""]
[{"$f":"'Methods&Limits'!A50","v":"-- Tert-butyl alcohol"},{"$f":"'Methods&Limits'!B50","v":"% V/V"},{"$f":"'Methods&Limits'!E50","v":"EN 13132"},{"$f":"'Methods&Limits'!F50","v":2002},{"$f":"'Methods&Limits'!G50","v":1},null,{"$f":"'Methods&Limits'!I50","v":15.59},""]
[{"$f":"'Methods&Limits'!A51","v":"-- Iso-butyl alcohol"},{"$f":"'Methods&Limits'!B51","v":"% V/V"},{"$f":"'Methods&Limits'!E51","v":"EN 13132"},{"$f":"'Methods&Limits'!F51","v":2002},{"$f":"'Methods&Limits'!G51","v":1},null,{"$f":"'Methods&Limits'!I51","v":15.59},""]
[{"$f":"'Methods&Limits'!A52","v":"-- Ethers with 5 or more carbon atoms per molecule"},{"$f":"'Methods&Limits'!B52","v":"% V/V"},{"$f":"'Methods&Limits'!E52","v":"EN 13132"},{"$f":"'Methods&Limits'!F52","v":2002},{"$f":"'Methods&Limits'!G52","v":1},null,{"$f":"'Methods&Limits'!I52","v":22.59},""]
[{"$f":"'Methods&Limits'!A53","v":"-- other oxygenates"},{"$f":"'Methods&Limits'!B53","v":"% V/V"},{"$f":"'Methods&Limits'!E53","v":"EN 13132"},{"$f":"'Methods&Limits'!F53","v":2002},{"$f":"'Methods&Limits'!G53","v":1},null,{"$f":"'Methods&Limits'!I53","v":15.59},""]
[{"$f":"'Methods&Limits'!A54","v":"Oxygen content"},{"$f":"'Methods&Limits'!B54","v":"% (m/m)"},{"$f":"'Methods&Limits'!E54","v":"EN-ISO 22854"},{"$f":"'Methods&Limits'!F54","v":2021},{"$f":"'Methods&Limits'!G54","v":0.4},null,{"$f":"'Methods&Limits'!I54","v":3.9359999999999999},{"$f":"IF(E28=\"\",\"\",IF(E28>G107,\"Yes\",\"\"))","v":""}]
[null,null,{"$f":"'Methods&Limits'!E55","v":"EN-ISO 22854"},{"$f":"'Methods&Limits'!F55","v":2021},{"$f":"'Methods&Limits'!G55","v":0.4},null,{"$f":"'Methods&Limits'!I55","v":2.9359999999999999},{"$f":"IF(E29=\"\",\"\",IF(E29>G108,\"Yes\",\"\"))","v":""}]
[{"$f":"'Methods&Limits'!A56","v":"Oxyginates"}]
[{"$f":"'Methods&Limits'!A57","v":"-- Methanol"},{"$f":"'Methods&Limits'!B57","v":"% V/V"},{"$f":"'Methods&Limits'!E57","v":"EN-ISO 22854"},{"$f":"'Methods&Limits'!F57","v":2021},{"$f":"'Methods&Limits'!G57","v":0.4},null,{"$f":"'Methods&Limits'!I57","v":3.2359999999999998},{"$f":"IF(E31=\"\",\"\",IF(E31>G110,\"Yes\",\"\"))","v":""}]
[{"$f":"'Methods&Limits'!A58","v":"-- Ethanol"},{"$f":"'Methods&Limits'!B58","v":"% V/V"},{"$f":"'Methods&Limits'!E58","v":"EN-ISO 22854"},{"$f":"'Methods&Limits'!F58","v":2021},{"$f":"'Methods&Limits'!G58","v":0.6},null,{"$f":"'Methods&Limits'!I58","v":10.353999999999999},""]
[{"$f":"'Methods&Limits'!A59","v":"-- Iso-propyl alcohol"},{"$f":"'Methods&Limits'!B59","v":"% V/V"},{"$f":"'Methods&Limits'!E59","v":"EN-ISO 22854"},{"$f":"'Methods&Limits'!F59","v":2021},{"$f":"'Methods&Limits'!G59","v":0.7},null,{"$f":"'Methods&Limits'!I59","v":12.413},""]
[{"$f":"'Methods&Limits'!A60","v":"-- Tert-butyl alcohol"},{"$f":"'Methods&Limits'!B60","v":"% V/V"},{"$f":"'Methods&Limits'!E60","v":"EN-ISO 22854"},{"$f":"'Methods&Limits'!F60","v":2021},{"$f":"'Methods&Limits'!G60","v":0.7},null,{"$f":"'Methods&Limits'!I60","v":15.413},""]
[{"$f":"'Methods&Limits'!A61","v":"-- Iso-butyl alcohol"},{"$f":"'Methods&Limits'!B61","v":"% V/V"},{"$f":"'Methods&Limits'!E61","v":"EN-ISO 22854"},{"$f":"'Methods&Limits'!F61","v":2021},{"$f":"'Methods&Limits'!G61","v":0.7},null,{"$f":"'Methods&Limits'!I61","v":15.413},""]
[{"$f":"'Methods&Limits'!A62","v":"-- Ethers with 5 or more carbon atoms per molecule"},{"$f":"'Methods&Limits'!B62","v":"% V/V"},{"$f":"'Methods&Limits'!E62","v":"EN-ISO 22854"},{"$f":"'Methods&Limits'!F62","v":2021},{"$f":"'Methods&Limits'!G62","v":0.9},null,{"$f":"'Methods&Limits'!I62","v":22.530999999999999},""]
[{"$f":"'Methods&Limits'!A63","v":"-- other oxygenates"},{"$f":"'Methods&Limits'!B63","v":"% V/V"},{"$f":"'Methods&Limits'!E63","v":"EN-ISO 22854"},{"$f":"'Methods&Limits'!F63","v":2021},{"$f":"'Methods&Limits'!G63","v":0.7},null,{"$f":"'Methods&Limits'!I63","v":15.413},""]
[{"$f":"'Methods&Limits'!A64:A64","v":"Sulphur content (sulphur free, from 2005)**"},{"$f":"'Methods&Limits'!B64","v":"mg/kg"},{"$f":"'Methods&Limits'!E64","v":"EN-ISO 14596"},{"$f":"'Methods&Limits'!F64","v":2018},{"$f":"'Methods&Limits'!G64","v":5},null,{"$f":"'Methods&Limits'!I64","v":12.95},{"$f":"IF(E$38=\"\",\"\",IF(E$38>G117,\"Yes\",\"\"))","v":""}]
[null,null,{"$f":"'Methods&Limits'!E65","v":"EN 24260"},{"$f":"'Methods&Limits'!F65","v":1994},{"$f":"'Methods&Limits'!G65","v":1},null,{"$f":"'Methods&Limits'!I65","v":10.59},{"$f":"IF(E$38=\"\",\"\",IF(E$38>G118,\"Yes\",\"\"))","v":""}]
[null,null,{"$f":"'Methods&Limits'!E66","v":"EN-ISO 20846"},{"$f":"'Methods&Limits'!F66","v":2019},{"$f":"'Methods&Limits'!G66","v":2.7},null,{"$f":"'Methods&Limits'!I66","v":11.593},{"$f":"IF(E$38=\"\",\"\",IF(E$38>G119,\"Yes\",\"\"))","v":""}]
[null,null,{"$f":"'Methods&Limits'!E67","v":"EN-ISO 20884"},{"$f":"'Methods&Limits'!F67","v":2019},{"$f":"'Methods&Limits'!G67","v":3.1},null,{"$f":"'Methods&Limits'!I67","v":11.829000000000001},{"$f":"IF(E$38=\"\",\"\",IF(E$38>G120,\"Yes\",\"\"))","v":""}]
[{"$f":"'Methods&Limits'!A68:A68","v":"Lead content"},{"$f":"'Methods&Limits'!B68","v":"g/l"},{"$f":"'Methods&Limits'!E68","v":"EN 237"},{"$f":"'Methods&Limits'!F68","v":2004},{"$f":"'Methods&Limits'!G68","v":6.1999999999999998E-3},null,{"$f":"'Methods&Limits'!I68","v":8.657999999999999E-3},{"$f":"IF(E39=\"\",\"\",IF(E39>G121,\"Yes\",\"\"))","v":""}]

{"sheet":"Petrol (9)","index":25,"n_rows":121,"n_cols":18,"rows_kept":121,"cut":false,"hidden":false,"merged":[[2,1,2,4],[2,6,9,16],[3,1,3,4],[4,1,4,4],[5,1,5,4],[6,1,6,4],[7,2,7,4],[13,2,14,10],[13,11,13,14],[13,15,13,16],[14,11,14,12],[14,13,14,14],[14,15,14,16],[58,2,58,8],[58,9,58,12],[20,15,22,15],[27,15,28,15],[27,16,28,16],[43,0,43,3],[44,4,45,11],[46,4,46,11],[47,4,47,11],[48,4,48,11],[49,4,49,11],[50,4,50,11],[53,0,53,11],[71,11,71,12],[59,5,59,6],[59,9,60,9],[61,11,61,12],[62,11,62,12],[63,11,63,12],[64,11,64,12],[66,11,66,12],[67,11,67,12],[68,11,68,12],[69,11,69,12],[70,11,70,12],[59,11,59,12],[85,11,85,12],[72,11,72,12],[74,11,74,12],[75,11,75,12],[77,11,77,12],[78,11,78,12],[79,11,79,12],[80,11,80,12],[81,11,81,12],[82,11,82,12],[83,11,83,12],[84,11,84,12],[99,11,99,12],[86,11,86,12],[87,11,87,12],[89,11,89,12],[90,11,90,12],[91,11,91,12],[92,11,92,12],[93,11,93,12],[94,11,94,12],[95,11,95,12],[96,11,96,12],[97,11,97,12],[112,11,112,12],[100,11,100,12],[101,11,101,12],[102,11,102,12],[103,11,103,12],[104,11,104,12],[105,11,105,12],[106,11,106,12],[107,11,107,12],[109,11,109,12],[110,11,110,12],[111,11,111,12],[119,11,119,12],[120,11,120,12],[121,11,121,12],[122,11,122,12],[113,11,113,12],[114,11,114,12],[115,11,115,12],[116,11,116,12],[117,11,117,12],[118,11,118,12]]}
["Market Fuels used in Vehicles with Spark Ignition Engines (Petrol)",null,null,null,null,null,null,null,null,null,null,null,null,null,null,null,null,"<-- GO BACK"]
[]
["Country",{"$f":"IF(LEN('Contacts&Annual Summary'!C9) > 1,'Contacts&Annual Summary'!C9,\"\")","v":""},null,null,null,null,"Notes on completing the tables\nThe table structure has been locked to prevent modification - data can be copied and pasted, in bulk into the Reporting Results blue table cells.  Where a white row exists between rows, it will not be possible to paste over white rows and sections should be pasted separately.\n\nColumn H in the Test Methods and Analysis table is set to automatically check whether the values entered in the Reporting Results table exceed maximum or minimum Tolerance Limits.  If any exceedance is detected, please provide details in the columns to the right including the number of samples, location samples were taken from, Values and Details of any action taken to address non-compliant samples.  Compliance information is verified manually and this automated compliance check is not solely relied upon during data analysis.\n\nPlease do not unlock this template - modified templates cannot be processed and may delay reporting."]
["Reporting Year",{"$f":"'Contacts&Annual Summary'!C8","v":2023}]
["Period (Summer or Winter)","Summer"]
["Parent fuel grade","Petrol"]
["National fuel grade"]
["Summer Period (N or A)*",0,{"$f":"IF( B8=\"A\",\"1st June to 31st August (arctic)\",\"1st May to 30th September (normal)\")","v":"1st May to 30th September (normal)"}]
["The maximum bioethanol content (% v/v)",0,"Please include the bioethanol content as a numerical figure in % V/V"]
["* N = 1st May to 30th September (normal) ; A = 1st June to 31st August (arctic)."]
[]
["Reporting results"]
[]
["Parameter","Unit","Analytical and statistical results \n(Please see an explanation and examples for new columns/ information required in Cells I15 to K37 on the Introduction & Instructions tab).",null,null,null,null,null,null,null,null,"Limiting Value (1)",null,null,null,"Test method"]
[null,null,null,null,null,null,null,null,null,null,null,"National Specification, if any",null,"According to Directive 2009/30/EC",null,"(more recent versions may also be used)"]
[null,null,"No Samples","Minimum","Maximum","Median","Mean","Standard Deviation","No Samples outside 95% tolerance limit","25% of Sample Value","75% of Sample Value","Minimum","Maximum","Minimum","Maximum","Method","Date"]
["Research Octane Number","--",0,0,0,0,0,0,0,0,0,null,null,"95 (2)",null,"EN-ISO 5164",2005]
["Motor Octane Number","--",0,0,0,0,0,0,0,0,0,null,null,"85 (3)",null,"EN-ISO 5163",2005]
["Vapour Pressure, DVPE (6)","kPa",null,null,null,null,null,null,null,null,null,null,null,null,"(4)"]
["-- required for summer period only",null,0,0,0,0,0,0,0,0,0,null,null,null,{"$f":"IF(E8=\"A\",70,60)","v":60},"EN 13106-1",2007]
["Distillation",null,null,null,null,null,null,null,null,null,null,null,null,null,null,"EN-ISO 3405"]
["-- evaporated at 100 oC","% V/V",0,0,0,0,0,0,0,0,0,null,null,46,null,null,2000]
["-- evaporated at 150 oC ","% V/V",0,0,0,0,0,0,0,0,0,null,null,75]
["Hydrocarbon analysis"]
["-- Olefins","% V/V",0,0,0,0,0,0,0,0,0,null,null,null,"18.0 (5)","ASTM D 1319\nEN 15553\nEN-ISO 22854","1995\n2007\n2008"]
["-- Aromatics","% V/V",0,0,0,0,0,0,0,0,0,null,null,null,35,"EN-ISO 22854","1995\n2008"]
["-- Benzene","% V/V",0,0,0,0,0,0,0,0,0,null,null,null,1,"EN 238\nEN 12177\nEN-ISO 22854","1996\n1998\n2008"]
[{"$f":"IF(C29>0,\"Do not complete\",\"Oxygen content\")","v":"Oxygen content"},"% (m/m)",0,0,0,0,0,0,0,0,0,null,null,null,3.7,"EN 1601\nEN 13132\nEN-ISO 22854","1997\n2000\n2008"]
[{"$f":"IF(C28>0,\"Do not complete\",\"Oxygen content*\n*petrol with 5% (v/v) or less ethanol content\")","v":"Oxygen content*\n*petrol with 5% (v/v) or less ethanol content"},"% (m/m)",0,0,0,0,0,0,0,0,0,null,null,null,2.7]
["Oxygenates"]
["-- Methanol","% V/V",0,0,0,0,0,0,0,0,0,null,null,null,3]
["-- Ethanol","% V/V",0,0,0,0,0,0,0,0,0,null,null,null,10]
["-- Iso-propyl alcohol","% V/V",0,0,0,0,0,0,0,0,0,null,null,null,12,"EN 1601",1997]
["-- Tert-butyl alcohol","% V/V",0,0,0,0,0,0,0,0,0,null,null,null,15,"EN 13132",2000]
["-- Iso-butyl alcohol","% V/V",0,0,0,0,0,0,0,0,0,null,null,null,15,"EN-ISO 22854",2008]
["-- Ethers with ≥5 carbon atoms / molecule","% V/V",0,0,0,0,0,0,0,0,0,null,null,null,22]
["-- other oxygenates","% V/V",0,0,0,0,0,0,0,0,0,null,null,null,15]
["Sulphur content","mg/kg",0,0,0,0,0,0,0,0,0,null,null,null,10,"EN-ISO 14596\nEN 24260\nEN-ISO 20846\nEN-ISO 20884","1998\n1994\n2004\n2004"]
["Lead content","g/l",0,0,0,0,0,0,0,0,0,null,null,null,5.0000000000000001E-3,"EN 237",1996]
[]
[]
["Sampling frequency"]
[]
["Number of samples in month"]
["January",0,"July",0,"(1) The limiting values are \"true values\" and were established according to the procedures for limit setting in EN 228:2008  The results of individual measurements shall be interpreted following the criteria described in EN 228:2008."]
["February",0,"August",0]
["March",0,"September",0,"(2) 91 for unleaded regular grade petrol: See 2009/30/EC Annex I, Footnote 3."]
["April",0,"October",0,"(3) 81 for unleaded regular grade petrol: See 2009/30/EC Annex I, Footnote 3."]
["May",0,"November",0,"(4) 70 kPa for Member States with arctic or severe weather conditions: See 2003/30/EC Annex I, Footnotes 4 & 5."]
["June",0,"December",0,"(5) 21 for unleaded regular grade petrol: See 98/70/EC, Annex I, Footnote 6."]
[null,null,"Summer Months Total",{"$f":"SUM(B45:B50,D45:D50)","v":0},"(6) Vapour pressure waiver applies for petrol containing Bioethanol, see 2009/30/EC Annex I, Footnote 5 and Annex III."]
[]
["Other notes (optional):"]
[]
[]
[]
["Test Methods and Analysis"]
[]
["Parameter","Unit","Test specified in 2009/30/EC or EN228:2008",null,null,null,null,null,null,"Notes on exceedences"]
[null,null,"Method","Date","Reproducability, R","Tolerance limits",null,null,null,"Sample location (S,T or R)","Values","Details/action taken"]
[null,null,null,null,null,"Minimum","Maximum","Exceeded?"]
[{"$f":"'Methods&Limits'!A9","v":"Research Octane Number (RON)"},{"$f":"'Methods&Limits'!B9","v":"--"},{"$f":"'Methods&Limits'!E9","v":"EN-ISO 5164"},{"$f":"'Methods&Limits'!F9","v":2014},{"$f":"'Methods&Limits'!G9","v":0.7},{"$f":"'Methods&Limits'!H9","v":94.587000000000003},null,{"$f":"IF(D17=\"\",\"\",IF(D17<F62,\"Yes\",\"\"))","v":"Yes"}]
[{"$f":"'Methods&Limits'!A10","v":"(RON 91 fuel only)"},{"$f":"'Methods&Limits'!B10","v":"--"},{"$f":"'Methods&Limits'!E10","v":"EN-ISO 5164"},{"$f":"'Methods&Limits'!F10","v":2014},{"$f":"'Methods&Limits'!G10","v":0.7},{"$f":"'Methods&Limits'!H10","v":90.587000000000003},null,{"$f":"IF(D17=\"\",\"\",IF(D17<F63,\"Yes\",\"\"))","v":"Yes"}]
[{"$f":"'Methods&Limits'!A11","v":"Motor Octane Number (MON)"},{"$f":"'Methods&Limits'!B11","v":"--"},{"$f":"'Methods&Limits'!E11","v":"EN-ISO 5163"},{"$f":"'Methods&Limits'!F11","v":2014},{"$f":"'Methods&Limits'!G11","v":0.9},{"$f":"'Methods&Limits'!H11","v":84.468999999999994},null,{"$f":"IF(D18=\"\",\"\",IF(D18<F64,\"Yes\",\"\"))","v":"Yes"}]
[{"$f":"'Methods&Limits'!A12","v":"(RON 91 fuel only)"},{"$f":"'Methods&Limits'!B12","v":"--"},{"$f":"'Methods&Limits'!E12","v":"EN-ISO 5163"},{"$f":"'Methods&Limits'!F12","v":2014},{"$f":"'Methods&Limits'!G12","v":0.9},{"$f":"'Methods&Limits'!H12","v":80.468999999999994},null,{"$f":"IF(D18=\"\",\"\",IF(D18<F65,\"Yes\",\"\"))","v":"Yes"}]
[{"$f":"'Methods&Limits'!A13","v":"Vapour Pressure, DVPE"}]
[{"$f":"'Methods&Limits'!A14","v":"--summer period (normal)"},{"$f":"'Methods&Limits'!B14","v":"kPa"},{"$f":"'Methods&Limits'!E14","v":"EN 13016-1"},{"$f":"'Methods&Limits'!F14","v":2018},{"$f":"'Methods&Limits'!G14","v":2.2000000000000002},null,{"$f":"'Methods&Limits'!I14","v":61.298000000000002},{"$f":"IF(E20>G67,\"Yes\",\"\")","v":""}]
[{"$f":"'Methods&Limits'!A15","v":"-- Petrol with bioethanol content 0-2"},{"$f":"'Methods&Limits'!B15","v":"kPa"},{"$f":"'Methods&Limits'!E15","v":"EN 1601"},{"$f":"'Methods&Limits'!F15","v":2017},{"$f":"'Methods&Limits'!G15","v":2.2999999999999998},null,{"$f":"'Methods&Limits'!I15","v":67.307000000000002},{"$f":"IF(E20>G68,\"Yes\",\"\")","v":""}]
[{"$f":"'Methods&Limits'!A16","v":"-- Petrol with bioethanol content 2-4"},{"$f":"'Methods&Limits'!B16","v":"kPa"},{"$f":"'Methods&Limits'!E16","v":"EN 1601"},{"$f":"'Methods&Limits'!F16","v":2017},{"$f":"'Methods&Limits'!G16","v":2.2999999999999998},null,{"$f":"'Methods&Limits'!I16","v":69.156999999999996},{"$f":"IF(E20>G69,\"Yes\",\"\")","v":""}]
[{"$f":"'Methods&Limits'!A17","v":"-- Petrol with bioethanol content 4-6"},{"$f":"'Methods&Limits'!B17","v":"kPa"},{"$f":"'Methods&Limits'!E17","v":"EN 1601"},{"$f":"'Methods&Limits'!F17","v":2017},{"$f":"'Methods&Limits'!G17","v":2.2999999999999998},null,{"$f":"'Methods&Limits'!I17","v":69.356999999999999},{"$f":"IF(E20>G70,\"Yes\",\"\")","v":""}]
[{"$f":"'Methods&Limits'!A18","v":"-- Petrol with bioethanol content 6-8"},{"$f":"'Methods&Limits'!B18","v":"kPa"},{"$f":"'Methods&Limits'!E18","v":"EN 1601"},{"$f":"'Methods&Limits'!F18","v":2017},{"$f":"'Methods&Limits'!G18","v":2.2999999999999998},null,{"$f":"'Methods&Limits'!I18","v":69.236999999999995},{"$f":"IF(E20>G71,\"Yes\",\"\")","v":""}]
[{"$f":"'Methods&Limits'!A19","v":"-- Petrol with bioethanol content 8-10"},{"$f":"'Methods&Limits'!B19","v":"kPa"},{"$f":"'Methods&Limits'!E19","v":"EN 1601"},{"$f":"'Methods&Limits'!F19","v":2017},{"$f":"'Methods&Limits'!G19","v":2.2999999999999998},null,{"$f":"'Methods&Limits'!I19","v":69.117000000000004},{"$f":"IF(E20>G72,\"Yes\",\"\")","v":""}]
[{"$f":"'Methods&Limits'!A20","v":"--summer period (arctic or severe weather conditions)"},{"$f":"'Methods&Limits'!B20","v":"kPa"},{"$f":"'Methods&Limits'!E20","v":"EN 13016-1"},{"$f":"'Methods&Limits'!F20","v":2018},{"$f":"'Methods&Limits'!G20","v":2.2999999999999998},null,{"$f":"'Methods&Limits'!I20","v":71.356999999999999},{"$f":"IF(E20>G73,\"Yes\",\"\")","v":""}]
[{"$f":"'Methods&Limits'!A21","v":"Distillation *"}]
[{"$f":"'Methods&Limits'!A22","v":"--evaporated at 100 oC"},{"$f":"'Methods&Limits'!B22","v":"% V/V"},{"$f":"'Methods&Limits'!E22","v":"EN-ISO 3405"},{"$f":"'Methods&Limits'!F22","v":2020},{"$f":"'Methods&Limits'!G22","v":4},{"$f":"'Methods&Limits'!H22","v":43.64},null,{"$f":"IF(D22=\"\",\"\",IF(D22<F75,\"Yes\",\"\"))","v":"Yes"}]
[{"$f":"'Methods&Limits'!A23","v":"-- evaporated at 150 oC "},{"$f":"'Methods&Limits'!B23","v":"% V/V"},{"$f":"'Methods&Limits'!E23","v":"EN-ISO 3405"},{"$f":"'Methods&Limits'!F23","v":2020},{"$f":"'Methods&Limits'!G23","v":4},{"$f":"'Methods&Limits'!H23","v":72.64},null,{"$f":"IF(D23=\"\",\"\",IF(D23<F76,\"Yes\",\"\"))","v":"Yes"}]
[{"$f":"'Methods&Limits'!A24","v":"Hydrocarbon analysis"},null,null,null,null,null,null,{"$f":"IF(D24<F77,\"Yes\",\"\")","v":""}]
[{"$f":"'Methods&Limits'!A25","v":"-- Olefins"},{"$f":"'Methods&Limits'!B25","v":"% V/V"},{"$f":"'Methods&Limits'!E25","v":"EN 15553"},{"$f":"'Methods&Limits'!F25","v":2021},{"$f":"'Methods&Limits'!G25","v":6.4},null,{"$f":"'Methods&Limits'!I25","v":21.776},{"$f":"IF($E$25>G78,\"Yes\",\"\")","v":""}]
[null,null,{"$f":"'Methods&Limits'!E26","v":"EN-ISO 22854"},{"$f":"'Methods&Limits'!F26","v":2021},{"$f":"'Methods&Limits'!G26","v":2.6},null,{"$f":"'Methods&Limits'!I26","v":19.533999999999999},{"$f":"IF($E$25>G79,\"Yes\",\"\")","v":""}]
[{"$f":"'Methods&Limits'!A27","v":"*without oxygenates"},null,{"$f":"'Methods&Limits'!E27","v":"EN 15553"},{"$f":"'Methods&Limits'!F27","v":2021},{"$f":"'Methods&Limits'!G27","v":"-"},null,{"$f":"'Methods&Limits'!I27","v":"-"},{"$f":"IF($E$25>G80,\"Yes\",\"\")","v":""}]
[null,null,{"$f":"'Methods&Limits'!E28","v":"EN-ISO 22854"},{"$f":"'Methods&Limits'!F28","v":2021},{"$f":"'Methods&Limits'!G28","v":"-"},null,{"$f":"'Methods&Limits'!I28","v":"-"},{"$f":"IF($E$25>G81,\"Yes\",\"\")","v":""}]
[{"$f":"'Methods&Limits'!A29","v":"-- Olefins (RON 91 fuel only)***"},{"$f":"'Methods&Limits'!B29","v":"% V/V"},{"$f":"'Methods&Limits'!E29","v":"ASTM D1319"},{"$f":"'Methods&Limits'!F29","v":2020},{"$f":"'Methods&Limits'!G29","v":5.0999999999999996},null,{"$f":"'Methods&Limits'!I29","v":24.009},{"$f":"IF($E$25>G82,\"Yes\",\"\")","v":""}]
[{"$f":"'Methods&Limits'!A30","v":"-- Aromatics (from 2005)"},null,{"$f":"'Methods&Limits'!E30","v":"EN-ISO 22854"},{"$f":"'Methods&Limits'!F30","v":2021},{"$f":"'Methods&Limits'!G30","v":1.7},null,{"$f":"'Methods&Limits'!I30","v":36.003},{"$f":"IF($E$26>G83,\"Yes\",\"\")","v":""}]
[{"$f":"'Methods&Limits'!A31","v":"-- Benzene"},{"$f":"'Methods&Limits'!B31","v":"% V/V"},{"$f":"'Methods&Limits'!E31","v":"EN 12177"},{"$f":"'Methods&Limits'!F31","v":2022},{"$f":"'Methods&Limits'!G31","v":0.1},null,{"$f":"'Methods&Limits'!I31","v":1.0589999999999999},{"$f":"IF(E27>G84,\"Yes\",\"\")","v":""}]
[null,null,{"$f":"'Methods&Limits'!E32","v":"EN 238"},{"$f":"'Methods&Limits'!F32","v":1996},{"$f":"'Methods&Limits'!G32","v":0.17},null,{"$f":"'Methods&Limits'!I32","v":1.1003000000000001},{"$f":"IF(E27>G85,\"Yes\",\"\")","v":""}]
[null,null,{"$f":"'Methods&Limits'!E33","v":"EN-ISO 22854"},{"$f":"'Methods&Limits'!F33","v":2021},{"$f":"'Methods&Limits'!G33","v":0.05},null,{"$f":"'Methods&Limits'!I33","v":1.0295000000000001},{"$f":"IF(E27>G86,\"Yes\",\"\")","v":""}]
[{"$f":"'Methods&Limits'!A34","v":"Oxygen content"},{"$f":"'Methods&Limits'!B34","v":"% (m/m)"},{"$f":"'Methods&Limits'!E34","v":"EN 1601"},{"$f":"'Methods&Limits'!F34","v":2017},{"$f":"'Methods&Limits'!G34","v":0.41},null,{"$f":"'Methods&Limits'!I34","v":3.9419},{"$f":"IF(E28>G87,\"Yes\",\"\")","v":""}]
[null,null,{"$f":"'Methods&Limits'!E35","v":"EN 1601"},{"$f":"'Methods&Limits'!F35","v":2017},{"$f":"'Methods&Limits'!G35","v":0.41},null,{"$f":"'Methods&Limits'!I35","v":2.9419},{"$f":"IF(E29>G88,\"Yes\",\"\")","v":""}]
[{"$f":"'Methods&Limits'!A36","v":"Oxygenates"}]
[{"$f":"'Methods&Limits'!A37","v":"-- Methanol"},{"$f":"'Methods&Limits'!B37","v":"% V/V"},{"$f":"'Methods&Limits'!E37","v":"EN 1601"},{"$f":"'Methods&Limits'!F37","v":2017},{"$f":"'Methods&Limits'!G37","v":0.3},null,{"$f":"'Methods&Limits'!I37","v":3.177},{"$f":"IF(E31>G90,\"Yes\",\"\")","v":""}]
[{"$f":"'Methods&Limits'!A38","v":"-- Ethanol"},{"$f":"'Methods&Limits'!B38","v":"% V/V"},{"$f":"'Methods&Limits'!E38","v":"EN 1601"},{"$f":"'Methods&Limits'!F38","v":2017},{"$f":"'Methods&Limits'!G38","v":0.8},null,{"$f":"'Methods&Limits'!I38","v":10.472},""]
[{"$f":"'Methods&Limits'!A39","v":"-- Iso-propyl alcohol"},{"$f":"'Methods&Limits'!B39","v":"% V/V"},{"$f":"'Methods&Limits'!E39","v":"EN 1601"},{"$f":"'Methods&Limits'!F39","v":2017},{"$f":"'Methods&Limits'!G39","v":0.9},null,{"$f":"'Methods&Limits'!I39","v":12.531000000000001},""]
[{"$f":"'Methods&Limits'!A40","v":"-- Tert-butyl alcohol"},{"$f":"'Methods&Limits'!B40","v":"% V/V"},{"$f":"'Methods&Limits'!E40","v":"EN 1601"},{"$f":"'Methods&Limits'!F40","v":2017},{"$f":"'Methods&Limits'!G40","v":1},null,{"$f":"'Methods&Limits'!I40","v":15.59},""]
[{"$f":"'Methods&Limits'!A41","v":"-- Iso-butyl alcohol"},{"$f":"'Methods&Limits'!B41","v":"% V/V"},{"$f":"'Methods&Limits'!E41","v":"EN 1601"},{"$f":"'Methods&Limits'!F41","v":2017},{"$f":"'Methods&Limits'!G41","v":1},null,{"$f":"'Methods&Limits'!I41","v":15.59},""]
[{"$f":"'Methods&Limits'!A42","v":"-- Ethers with 5 or more carbon atoms per molecule"},{"$f":"'Methods&Limits'!B42","v":"% V/V"},{"$f":"'Methods&Limits'!E42","v":"EN 1601"},{"$f":"'Methods&Limits'!F42","v":2017},{"$f":"'Methods&Limits'!G42","v":1},null,{"$f":"'Methods&Limits'!I42","v":22.59},""]
[{"$f":"'Methods&Limits'!A43","v":"-- other oxygenates"},{"$f":"'Methods&Limits'!B43","v":"% V/V"},{"$f":"'Methods&Limits'!E43","v":"EN 1601"},{"$f":"'Methods&Limits'!F43","v":2017},{"$f":"'Methods&Limits'!G43","v":1},null,{"$f":"'Methods&Limits'!I43","v":15.59},""]
[{"$f":"'Methods&Limits'!A44","v":"Oxygen content"},{"$f":"'Methods&Limits'!B44","v":"% (m/m)"},{"$f":"'Methods&Limits'!E44","v":"EN 13132"},{"$f":"'Methods&Limits'!F44","v":2002},{"$f":"'Methods&Limits'!G44","v":0.3},null,{"$f":"'Methods&Limits'!I44","v":3.8770000000000002},{"$f":"IF(E28>G97,\"Yes\",\"\")","v":""}]
[null,null,{"$f":"'Methods&Limits'!E45","v":"EN 13132"},{"$f":"'Methods&Limits'!F45","v":2002},{"$f":"'Methods&Limits'!G45","v":0.3},null,{"$f":"'Methods&Limits'!I45","v":2.8770000000000002},{"$f":"IF(E29>G98,\"Yes\",\"\")","v":""}]
[{"$f":"'Methods&Limits'!A46","v":"Oxygenates"}]
[{"$f":"'Methods&Limits'!A47","v":"-- Methanol"},{"$f":"'Methods&Limits'!B47","v":"% V/V"},{"$f":"'Methods&Limits'!E47","v":"EN 13132"},{"$f":"'Methods&Limits'!F47","v":2002},{"$f":"'Methods&Limits'!G47","v":0.3},null,{"$f":"'Methods&Limits'!I47","v":3.177},{"$f":"IF(E31>G100,\"Yes\",\"\")","v":""}]
[{"$f":"'Methods&Limits'!A48","v":"-- Ethanol"},{"$f":"'Methods&Limits'!B48","v":"% V/V"},{"$f":"'Methods&Limits'!E48","v":"EN 13132"},{"$f":"'Methods&Limits'!F48","v":2002},{"$f":"'Methods&Limits'!G48","v":0.8},null,{"$f":"'Methods&Limits'!I48","v":10.472},""]
[{"$f":"'Methods&Limits'!A49","v":"-- Iso-propyl alcohol"},{"$f":"'Methods&Limits'!B49","v":"% V/V"},{"$f":"'Methods&Limits'!E49","v":"EN 13132"},{"$f":"'Methods&Limits'!F49","v":2002},{"$f":"'Methods&Limits'!G49","v":0.8},null,{"$f":"'Methods&Limits'!I49","v":12.472},""]
[{"$f":"'Methods&Limits'!A50","v":"-- Tert-butyl alcohol"},{"$f":"'Methods&Limits'!B50","v":"% V/V"},{"$f":"'Methods&Limits'!E50","v":"EN 13132"},{"$f":"'Methods&Limits'!F50","v":2002},{"$f":"'Methods&Limits'!G50","v":1},null,{"$f":"'Methods&Limits'!I50","v":15.59},""]
[{"$f":"'Methods&Limits'!A51","v":"-- Iso-butyl alcohol"},{"$f":"'Methods&Limits'!B51","v":"% V/V"},{"$f":"'Methods&Limits'!E51","v":"EN 13132"},{"$f":"'Methods&Limits'!F51","v":2002},{"$f":"'Methods&Limits'!G51","v":1},null,{"$f":"'Methods&Limits'!I51","v":15.59},""]
[{"$f":"'Methods&Limits'!A52","v":"-- Ethers with 5 or more carbon atoms per molecule"},{"$f":"'Methods&Limits'!B52","v":"% V/V"},{"$f":"'Methods&Limits'!E52","v":"EN 13132"},{"$f":"'Methods&Limits'!F52","v":2002},{"$f":"'Methods&Limits'!G52","v":1},null,{"$f":"'Methods&Limits'!I52","v":22.59},""]
[{"$f":"'Methods&Limits'!A53","v":"-- other oxygenates"},{"$f":"'Methods&Limits'!B53","v":"% V/V"},{"$f":"'Methods&Limits'!E53","v":"EN 13132"},{"$f":"'Methods&Limits'!F53","v":2002},{"$f":"'Methods&Limits'!G53","v":1},null,{"$f":"'Methods&Limits'!I53","v":15.59},""]
[{"$f":"'Methods&Limits'!A54","v":"Oxygen content"},{"$f":"'Methods&Limits'!B54","v":"% (m/m)"},{"$f":"'Methods&Limits'!E54","v":"EN-ISO 22854"},{"$f":"'Methods&Limits'!F54","v":2021},{"$f":"'Methods&Limits'!G54","v":0.4},null,{"$f":"'Methods&Limits'!I54","v":3.9359999999999999},{"$f":"IF(E28>G107,\"Yes\",\"\")","v":""}]
[null,null,{"$f":"'Methods&Limits'!E55","v":"EN-ISO 22854"},{"$f":"'Methods&Limits'!F55","v":2021},{"$f":"'Methods&Limits'!G55","v":0.4},null,{"$f":"'Methods&Limits'!I55","v":2.9359999999999999},{"$f":"IF(E29>G108,\"Yes\",\"\")","v":""}]
[{"$f":"'Methods&Limits'!A56","v":"Oxyginates"}]
[{"$f":"'Methods&Limits'!A57","v":"-- Methanol"},{"$f":"'Methods&Limits'!B57","v":"% V/V"},{"$f":"'Methods&Limits'!E57","v":"EN-ISO 22854"},{"$f":"'Methods&Limits'!F57","v":2021},{"$f":"'Methods&Limits'!G57","v":0.4},null,{"$f":"'Methods&Limits'!I57","v":3.2359999999999998},{"$f":"IF(E31>G110,\"Yes\",\"\")","v":""}]
[{"$f":"'Methods&Limits'!A58","v":"-- Ethanol"},{"$f":"'Methods&Limits'!B58","v":"% V/V"},{"$f":"'Methods&Limits'!E58","v":"EN-ISO 22854"},{"$f":"'Methods&Limits'!F58","v":2021},{"$f":"'Methods&Limits'!G58","v":0.6},null,{"$f":"'Methods&Limits'!I58","v":10.353999999999999},""]
[{"$f":"'Methods&Limits'!A59","v":"-- Iso-propyl alcohol"},{"$f":"'Methods&Limits'!B59","v":"% V/V"},{"$f":"'Methods&Limits'!E59","v":"EN-ISO 22854"},{"$f":"'Methods&Limits'!F59","v":2021},{"$f":"'Methods&Limits'!G59","v":0.7},null,{"$f":"'Methods&Limits'!I59","v":12.413},""]
[{"$f":"'Methods&Limits'!A60","v":"-- Tert-butyl alcohol"},{"$f":"'Methods&Limits'!B60","v":"% V/V"},{"$f":"'Methods&Limits'!E60","v":"EN-ISO 22854"},{"$f":"'Methods&Limits'!F60","v":2021},{"$f":"'Methods&Limits'!G60","v":0.7},null,{"$f":"'Methods&Limits'!I60","v":15.413},""]
[{"$f":"'Methods&Limits'!A61","v":"-- Iso-butyl alcohol"},{"$f":"'Methods&Limits'!B61","v":"% V/V"},{"$f":"'Methods&Limits'!E61","v":"EN-ISO 22854"},{"$f":"'Methods&Limits'!F61","v":2021},{"$f":"'Methods&Limits'!G61","v":0.7},null,{"$f":"'Methods&Limits'!I61","v":15.413},""]
[{"$f":"'Methods&Limits'!A62","v":"-- Ethers with 5 or more carbon atoms per molecule"},{"$f":"'Methods&Limits'!B62","v":"% V/V"},{"$f":"'Methods&Limits'!E62","v":"EN-ISO 22854"},{"$f":"'Methods&Limits'!F62","v":2021},{"$f":"'Methods&Limits'!G62","v":0.9},null,{"$f":"'Methods&Limits'!I62","v":22.530999999999999},""]
[{"$f":"'Methods&Limits'!A63","v":"-- other oxygenates"},{"$f":"'Methods&Limits'!B63","v":"% V/V"},{"$f":"'Methods&Limits'!E63","v":"EN-ISO 22854"},{"$f":"'Methods&Limits'!F63","v":2021},{"$f":"'Methods&Limits'!G63","v":0.7},null,{"$f":"'Methods&Limits'!I63","v":15.413},""]
[{"$f":"'Methods&Limits'!A64:A64","v":"Sulphur content (sulphur free, from 2005)**"},{"$f":"'Methods&Limits'!B64","v":"mg/kg"},{"$f":"'Methods&Limits'!E64","v":"EN-ISO 14596"},{"$f":"'Methods&Limits'!F64","v":2018},{"$f":"'Methods&Limits'!G64","v":5},null,{"$f":"'Methods&Limits'!I64","v":12.95},{"$f":"IF(E$38>G117,\"Yes\",\"\")","v":""}]
[null,null,{"$f":"'Methods&Limits'!E65","v":"EN 24260"},{"$f":"'Methods&Limits'!F65","v":1994},{"$f":"'Methods&Limits'!G65","v":1},null,{"$f":"'Methods&Limits'!I65","v":10.59},{"$f":"IF(E$38>G118,\"Yes\",\"\")","v":""}]
[null,null,{"$f":"'Methods&Limits'!E66","v":"EN-ISO 20846"},{"$f":"'Methods&Limits'!F66","v":2019},{"$f":"'Methods&Limits'!G66","v":2.7},null,{"$f":"'Methods&Limits'!I66","v":11.593},{"$f":"IF(E$38>G119,\"Yes\",\"\")","v":""}]
[null,null,{"$f":"'Methods&Limits'!E67","v":"EN-ISO 20884"},{"$f":"'Methods&Limits'!F67","v":2019},{"$f":"'Methods&Limits'!G67","v":3.1},null,{"$f":"'Methods&Limits'!I67","v":11.829000000000001},{"$f":"IF(E$38>G120,\"Yes\",\"\")","v":""}]
[{"$f":"'Methods&Limits'!A68:A68","v":"Lead content"},{"$f":"'Methods&Limits'!B68","v":"g/l"},{"$f":"'Methods&Limits'!E68","v":"EN 237"},{"$f":"'Methods&Limits'!F68","v":2004},{"$f":"'Methods&Limits'!G68","v":6.1999999999999998E-3},null,{"$f":"'Methods&Limits'!I68","v":8.657999999999999E-3},{"$f":"IF($E$39>G121,\"Yes\",\"\")","v":""}]

{"sheet":"Petrol (10)","index":26,"n_rows":121,"n_cols":18,"rows_kept":121,"cut":false,"hidden":false,"merged":[[2,1,2,4],[2,6,9,16],[3,1,3,4],[4,1,4,4],[5,1,5,4],[6,1,6,4],[7,2,7,4],[13,2,14,10],[13,11,13,14],[13,15,13,16],[14,11,14,12],[14,13,14,14],[14,15,14,16],[58,2,58,8],[58,9,58,12],[20,15,22,15],[27,15,28,15],[27,16,28,16],[43,0,43,3],[44,4,45,11],[46,4,46,11],[47,4,47,11],[48,4,48,11],[49,4,49,11],[50,4,50,11],[53,0,53,11],[71,11,71,12],[59,5,59,6],[59,9,60,9],[61,11,61,12],[62,11,62,12],[63,11,63,12],[64,11,64,12],[66,11,66,12],[67,11,67,12],[68,11,68,12],[69,11,69,12],[70,11,70,12],[59,11,59,12],[85,11,85,12],[72,11,72,12],[74,11,74,12],[75,11,75,12],[77,11,77,12],[78,11,78,12],[79,11,79,12],[80,11,80,12],[81,11,81,12],[82,11,82,12],[83,11,83,12],[84,11,84,12],[99,11,99,12],[86,11,86,12],[87,11,87,12],[89,11,89,12],[90,11,90,12],[91,11,91,12],[92,11,92,12],[93,11,93,12],[94,11,94,12],[95,11,95,12],[96,11,96,12],[97,11,97,12],[112,11,112,12],[100,11,100,12],[101,11,101,12],[102,11,102,12],[103,11,103,12],[104,11,104,12],[105,11,105,12],[106,11,106,12],[107,11,107,12],[109,11,109,12],[110,11,110,12],[111,11,111,12],[119,11,119,12],[120,11,120,12],[121,11,121,12],[122,11,122,12],[113,11,113,12],[114,11,114,12],[115,11,115,12],[116,11,116,12],[117,11,117,12],[118,11,118,12]]}
["Market Fuels used in Vehicles with Spark Ignition Engines (Petrol)",null,null,null,null,null,null,null,null,null,null,null,null,null,null,null,null,"<-- GO BACK"]
[]
["Country",{"$f":"IF(LEN('Contacts&Annual Summary'!C9) > 1,'Contacts&Annual Summary'!C9,\"\")","v":""},null,null,null,null,"Notes on completing the tables\nThe table structure has been locked to prevent modification - data can be copied and pasted, in bulk into the Reporting Results blue table cells.  Where a white row exists between rows, it will not be possible to paste over white rows and sections should be pasted separately.\n\nColumn H in the Test Methods and Analysis table is set to automatically check whether the values entered in the Reporting Results table exceed maximum or minimum Tolerance Limits.  If any exceedance is detected, please provide details in the columns to the right including the number of samples, location samples were taken from, Values and Details of any action taken to address non-compliant samples.  Compliance information is verified manually and this automated compliance check is not solely relied upon during data analysis.\n\nPlease do not unlock this template - modified templates cannot be processed and may delay reporting."]
["Reporting Year",{"$f":"'Contacts&Annual Summary'!C8","v":2023}]
["Period (Summer or Winter)","Winter"]
["Parent fuel grade","Petrol"]
["National fuel grade",{"$f":"'Petrol (9)'!B7","v":0}]
["Summer Period (N or A)*",0,{"$f":"IF( B8=\"A\",\"1st June to 31st August (arctic)\",\"1st May to 30th September (normal)\")","v":"1st May to 30th September (normal)"}]
["The maximum bioethanol content (% v/v)",0,"Please include the bioethanol content as a numerical figure in % V/V"]
["* N = 1st May to 30th September (normal) ; A = 1st June to 31st August (arctic)."]
[]
["Reporting results"]
[]
["Parameter","Unit","Analytical and statistical results \n(Please see an explanation and examples for new columns/ information required in Cells I15 to K37 on the Introduction & Instructions tab).",null,null,null,null,null,null,null,null,"Limiting Value (1)",null,null,null,"Test method"]
[null,null,null,null,null,null,null,null,null,null,null,"National Specification, if any",null,"According to Directive 2009/30/EC",null,"(more recent versions may also be used)"]
[null,null,"No Samples","Minimum","Maximum","Median","Mean","Standard Deviation","No Samples outside 95% tolerance limit","25% of Sample Value","75% of Sample Value","Minimum","Maximum","Minimum","Maximum","Method","Date"]
["Research Octane Number","--",0,0,0,0,0,0,0,0,0,null,null,"95 (2)",null,"EN-ISO 5164",2005]
["Motor Octane Number","--",0,0,0,0,0,0,0,0,0,null,null,"85 (3)",null,"EN-ISO 5163",2005]
["Vapour Pressure, DVPE (6)","kPa",null,null,null,null,null,null,null,null,null,null,null,null,"(4)"]
["-- required for summer period only",null,0,0,0,0,0,0,0,0,0,null,null,null,{"$f":"IF(E8=\"A\",70,60)","v":60},"EN 13106-1",2007]
["Distillation",null,null,null,null,null,null,null,null,null,null,null,null,null,null,"EN-ISO 3405"]
["-- evaporated at 100 oC","% V/V",0,0,0,0,0,0,0,0,0,null,null,46,null,null,2000]
["-- evaporated at 150 oC ","% V/V",0,0,0,0,0,0,0,0,0,null,null,75]
["Hydrocarbon analysis"]
["-- Olefins","% V/V",0,0,0,0,0,0,0,0,0,null,null,null,"18.0 (5)","ASTM D 1319\nEN 15553\nEN-ISO 22854","1995\n2007\n2008"]
["-- Aromatics","% V/V",0,0,0,0,0,0,0,0,0,null,null,null,35,"EN-ISO 22854","1995\n2008"]
["-- Benzene","% V/V",0,0,0,0,0,0,0,0,0,null,null,null,1,"EN 238\nEN 12177\nEN-ISO 22854","1996\n1998\n2008"]
[{"$f":"IF(C29>0,\"Do not complete\",\"Oxygen content\")","v":"Oxygen content"},"% (m/m)",0,0,0,0,0,0,0,0,0,null,null,null,3.7,"EN 1601\nEN 13132\nEN-ISO 22854","1997\n2000\n2008"]
[{"$f":"IF(C28>0,\"Do not complete\",\"Oxygen content*\n*petrol with 5% (v/v) or less ethanol content\")","v":"Oxygen content*\n*petrol with 5% (v/v) or less ethanol content"},"% (m/m)",0,0,0,0,0,0,0,0,0,null,null,null,2.7]
["Oxygenates"]
["-- Methanol","% V/V",0,0,0,0,0,0,0,0,0,null,null,null,3]
["-- Ethanol","% V/V",0,0,0,0,0,0,0,0,0,null,null,null,10]
["-- Iso-propyl alcohol","% V/V",0,0,0,0,0,0,0,0,0,null,null,null,12,"EN 1601",1997]
["-- Tert-butyl alcohol","% V/V",0,0,0,0,0,0,0,0,0,null,null,null,15,"EN 13132",2000]
["-- Iso-butyl alcohol","% V/V",0,0,0,0,0,0,0,0,0,null,null,null,15,"EN-ISO 22854",2008]
["-- Ethers with ≥5 carbon atoms / molecule","% V/V",0,0,0,0,0,0,0,0,0,null,null,null,22]
["-- other oxygenates","% V/V",0,0,0,0,0,0,0,0,0,null,null,null,15]
["Sulphur content","mg/kg",0,0,0,0,0,0,0,0,0,null,null,null,10,"EN-ISO 14596\nEN 24260\nEN-ISO 20846\nEN-ISO 20884","1998\n1994\n2004\n2004"]
["Lead content","g/l",0,0,0,0,0,0,0,0,0,null,null,null,5.0000000000000001E-3,"EN 237",1996]
[]
[]
["Sampling frequency"]
[]
["Number of samples in month"]
["January",0,"July",0,"(1) The limiting values are \"true values\" and were established according to the procedures for limit setting in EN 228:2008  The results of individual measurements shall be interpreted following the criteria described in EN 228:2008."]
["February",0,"August",0]
["March",0,"September",0,"(2) 91 for unleaded regular grade petrol: See 2009/30/EC Annex I, Footnote 3."]
["April",0,"October",0,"(3) 81 for unleaded regular grade petrol: See 2009/30/EC Annex I, Footnote 3."]
["May",0,"November",0,"(4) 70 kPa for Member States with arctic or severe weather conditions: See 2003/30/EC Annex I, Footnotes 4 & 5."]
["June",0,"December",0,"(5) 21 for unleaded regular grade petrol: See 98/70/EC, Annex I, Footnote 6."]
[null,null,"Winter Months Total",{"$f":"SUM(B45:B50,D45:D50)","v":0},"(6) Vapour pressure waiver applies for petrol containing Bioethanol, see 2009/30/EC Annex I, Footnote 5 and Annex III."]
[]
["Other notes (optional):"]
[]
[]
[]
["Test Methods and Analysis"]
[]
["Parameter","Unit","Test specified in 2009/30/EC or EN228:2008",null,null,null,null,null,null,"Notes on exceedences"]
[null,null,"Method","Date","Reproducability, R","Tolerance limits",null,null,null,"Sample location (S,T or R)","Values","Details/action taken"]
[null,null,null,null,null,"Minimum","Maximum","Exceeded?"]
[{"$f":"'Methods&Limits'!A9","v":"Research Octane Number (RON)"},{"$f":"'Methods&Limits'!B9","v":"--"},{"$f":"'Methods&Limits'!E9","v":"EN-ISO 5164"},{"$f":"'Methods&Limits'!F9","v":2014},{"$f":"'Methods&Limits'!G9","v":0.7},{"$f":"'Methods&Limits'!H9","v":94.587000000000003},null,{"$f":"IF(D17=\"\",\"\",IF(D17<F62,\"Yes\",\"\"))","v":"Yes"}]
[{"$f":"'Methods&Limits'!A10","v":"(RON 91 fuel only)"},{"$f":"'Methods&Limits'!B10","v":"--"},{"$f":"'Methods&Limits'!E10","v":"EN-ISO 5164"},{"$f":"'Methods&Limits'!F10","v":2014},{"$f":"'Methods&Limits'!G10","v":0.7},{"$f":"'Methods&Limits'!H10","v":90.587000000000003},null,{"$f":"IF(D17=\"\",\"\",IF(D17<F63,\"Yes\",\"\"))","v":"Yes"}]
[{"$f":"'Methods&Limits'!A11","v":"Motor Octane Number (MON)"},{"$f":"'Methods&Limits'!B11","v":"--"},{"$f":"'Methods&Limits'!E11","v":"EN-ISO 5163"},{"$f":"'Methods&Limits'!F11","v":2014},{"$f":"'Methods&Limits'!G11","v":0.9},{"$f":"'Methods&Limits'!H11","v":84.468999999999994},null,{"$f":"IF(D18=\"\",\"\",IF(D18<F64,\"Yes\",\"\"))","v":"Yes"}]
[{"$f":"'Methods&Limits'!A12","v":"(RON 91 fuel only)"},{"$f":"'Methods&Limits'!B12","v":"--"},{"$f":"'Methods&Limits'!E12","v":"EN-ISO 5163"},{"$f":"'Methods&Limits'!F12","v":2014},{"$f":"'Methods&Limits'!G12","v":0.9},{"$f":"'Methods&Limits'!H12","v":80.468999999999994},null,{"$f":"IF(D18=\"\",\"\",IF(D18<F65,\"Yes\",\"\"))","v":"Yes"}]
[{"$f":"'Methods&Limits'!A13","v":"Vapour Pressure, DVPE"}]
[{"$f":"'Methods&Limits'!A14","v":"--summer period (normal)"},{"$f":"'Methods&Limits'!B14","v":"kPa"},{"$f":"'Methods&Limits'!E14","v":"EN 13016-1"},{"$f":"'Methods&Limits'!F14","v":2018},{"$f":"'Methods&Limits'!G14","v":2.2000000000000002},null,{"$f":"'Methods&Limits'!I14","v":61.298000000000002}]
[{"$f":"'Methods&Limits'!A15","v":"-- Petrol with bioethanol content 0-2"},{"$f":"'Methods&Limits'!B15","v":"kPa"},{"$f":"'Methods&Limits'!E15","v":"EN 1601"},{"$f":"'Methods&Limits'!F15","v":2017},{"$f":"'Methods&Limits'!G15","v":2.2999999999999998},null,{"$f":"'Methods&Limits'!I15","v":67.307000000000002}]
[{"$f":"'Methods&Limits'!A16","v":"-- Petrol with bioethanol content 2-4"},{"$f":"'Methods&Limits'!B16","v":"kPa"},{"$f":"'Methods&Limits'!E16","v":"EN 1601"},{"$f":"'Methods&Limits'!F16","v":2017},{"$f":"'Methods&Limits'!G16","v":2.2999999999999998},null,{"$f":"'Methods&Limits'!I16","v":69.156999999999996}]
[{"$f":"'Methods&Limits'!A17","v":"-- Petrol with bioethanol content 4-6"},{"$f":"'Methods&Limits'!B17","v":"kPa"},{"$f":"'Methods&Limits'!E17","v":"EN 1601"},{"$f":"'Methods&Limits'!F17","v":2017},{"$f":"'Methods&Limits'!G17","v":2.2999999999999998},null,{"$f":"'Methods&Limits'!I17","v":69.356999999999999}]
[{"$f":"'Methods&Limits'!A18","v":"-- Petrol with bioethanol content 6-8"},{"$f":"'Methods&Limits'!B18","v":"kPa"},{"$f":"'Methods&Limits'!E18","v":"EN 1601"},{"$f":"'Methods&Limits'!F18","v":2017},{"$f":"'Methods&Limits'!G18","v":2.2999999999999998},null,{"$f":"'Methods&Limits'!I18","v":69.236999999999995}]
[{"$f":"'Methods&Limits'!A19","v":"-- Petrol with bioethanol content 8-10"},{"$f":"'Methods&Limits'!B19","v":"kPa"},{"$f":"'Methods&Limits'!E19","v":"EN 1601"},{"$f":"'Methods&Limits'!F19","v":2017},{"$f":"'Methods&Limits'!G19","v":2.2999999999999998},null,{"$f":"'Methods&Limits'!I19","v":69.117000000000004}]
[{"$f":"'Methods&Limits'!A20","v":"--summer period (arctic or severe weather conditions)"},{"$f":"'Methods&Limits'!B20","v":"kPa"},{"$f":"'Methods&Limits'!E20","v":"EN 13016-1"},{"$f":"'Methods&Limits'!F20","v":2018},{"$f":"'Methods&Limits'!G20","v":2.2999999999999998},null,{"$f":"'Methods&Limits'!I20","v":71.356999999999999}]
[{"$f":"'Methods&Limits'!A21","v":"Distillation *"}]
[{"$f":"'Methods&Limits'!A22","v":"--evaporated at 100 oC"},{"$f":"'Methods&Limits'!B22","v":"% V/V"},{"$f":"'Methods&Limits'!E22","v":"EN-ISO 3405"},{"$f":"'Methods&Limits'!F22","v":2020},{"$f":"'Methods&Limits'!G22","v":4},{"$f":"'Methods&Limits'!H22","v":43.64},null,{"$f":"IF(D22=\"\",\"\",IF(D22<F75,\"Yes\",\"\"))","v":"Yes"}]
[{"$f":"'Methods&Limits'!A23","v":"-- evaporated at 150 oC "},{"$f":"'Methods&Limits'!B23","v":"% V/V"},{"$f":"'Methods&Limits'!E23","v":"EN-ISO 3405"},{"$f":"'Methods&Limits'!F23","v":2020},{"$f":"'Methods&Limits'!G23","v":4},{"$f":"'Methods&Limits'!H23","v":72.64},null,{"$f":"IF(D23=\"\",\"\",IF(D23<F76,\"Yes\",\"\"))","v":"Yes"}]
[{"$f":"'Methods&Limits'!A24","v":"Hydrocarbon analysis"},null,null,null,null,null,null,{"$f":"IF(D24<F77,\"Yes\",\"\")","v":""}]
[{"$f":"'Methods&Limits'!A25","v":"-- Olefins"},{"$f":"'Methods&Limits'!B25","v":"% V/V"},{"$f":"'Methods&Limits'!E25","v":"EN 15553"},{"$f":"'Methods&Limits'!F25","v":2021},{"$f":"'Methods&Limits'!G25","v":6.4},null,{"$f":"'Methods&Limits'!I25","v":21.776},{"$f":"IF($E$25>G78,\"Yes\",\"\")","v":""}]
[null,null,{"$f":"'Methods&Limits'!E26","v":"EN-ISO 22854"},{"$f":"'Methods&Limits'!F26","v":2021},{"$f":"'Methods&Limits'!G26","v":2.6},null,{"$f":"'Methods&Limits'!I26","v":19.533999999999999},{"$f":"IF($E$25>G79,\"Yes\",\"\")","v":""}]
[{"$f":"'Methods&Limits'!A27","v":"*without oxygenates"},null,{"$f":"'Methods&Limits'!E27","v":"EN 15553"},{"$f":"'Methods&Limits'!F27","v":2021},{"$f":"'Methods&Limits'!G27","v":"-"},null,{"$f":"'Methods&Limits'!I27","v":"-"},{"$f":"IF($E$25>G80,\"Yes\",\"\")","v":""}]
[null,null,{"$f":"'Methods&Limits'!E28","v":"EN-ISO 22854"},{"$f":"'Methods&Limits'!F28","v":2021},{"$f":"'Methods&Limits'!G28","v":"-"},null,{"$f":"'Methods&Limits'!I28","v":"-"},{"$f":"IF($E$25>G81,\"Yes\",\"\")","v":""}]
[{"$f":"'Methods&Limits'!A29","v":"-- Olefins (RON 91 fuel only)***"},{"$f":"'Methods&Limits'!B29","v":"% V/V"},{"$f":"'Methods&Limits'!E29","v":"ASTM D1319"},{"$f":"'Methods&Limits'!F29","v":2020},{"$f":"'Methods&Limits'!G29","v":5.0999999999999996},null,{"$f":"'Methods&Limits'!I29","v":24.009},{"$f":"IF($E$25>G82,\"Yes\",\"\")","v":""}]
[{"$f":"'Methods&Limits'!A30","v":"-- Aromatics (from 2005)"},null,{"$f":"'Methods&Limits'!E30","v":"EN-ISO 22854"},{"$f":"'Methods&Limits'!F30","v":2021},{"$f":"'Methods&Limits'!G30","v":1.7},null,{"$f":"'Methods&Limits'!I30","v":36.003},{"$f":"IF($E$26>G83,\"Yes\",\"\")","v":""}]
[{"$f":"'Methods&Limits'!A31","v":"-- Benzene"},{"$f":"'Methods&Limits'!B31","v":"% V/V"},{"$f":"'Methods&Limits'!E31","v":"EN 12177"},{"$f":"'Methods&Limits'!F31","v":2022},{"$f":"'Methods&Limits'!G31","v":0.1},null,{"$f":"'Methods&Limits'!I31","v":1.0589999999999999},{"$f":"IF(E27>G84,\"Yes\",\"\")","v":""}]
[null,null,{"$f":"'Methods&Limits'!E32","v":"EN 238"},{"$f":"'Methods&Limits'!F32","v":1996},{"$f":"'Methods&Limits'!G32","v":0.17},null,{"$f":"'Methods&Limits'!I32","v":1.1003000000000001},{"$f":"IF(E27>G85,\"Yes\",\"\")","v":""}]
[null,null,{"$f":"'Methods&Limits'!E33","v":"EN-ISO 22854"},{"$f":"'Methods&Limits'!F33","v":2021},{"$f":"'Methods&Limits'!G33","v":0.05},null,{"$f":"'Methods&Limits'!I33","v":1.0295000000000001},{"$f":"IF(E27>G86,\"Yes\",\"\")","v":""}]
[{"$f":"'Methods&Limits'!A34","v":"Oxygen content"},{"$f":"'Methods&Limits'!B34","v":"% (m/m)"},{"$f":"'Methods&Limits'!E34","v":"EN 1601"},{"$f":"'Methods&Limits'!F34","v":2017},{"$f":"'Methods&Limits'!G34","v":0.41},null,{"$f":"'Methods&Limits'!I34","v":3.9419},{"$f":"IF(E28>G87,\"Yes\",\"\")","v":""}]
[null,null,{"$f":"'Methods&Limits'!E35","v":"EN 1601"},{"$f":"'Methods&Limits'!F35","v":2017},{"$f":"'Methods&Limits'!G35","v":0.41},null,{"$f":"'Methods&Limits'!I35","v":2.9419},{"$f":"IF(E29>G88,\"Yes\",\"\")","v":""}]
[{"$f":"'Methods&Limits'!A36","v":"Oxygenates"}]
[{"$f":"'Methods&Limits'!A37","v":"-- Methanol"},{"$f":"'Methods&Limits'!B37","v":"% V/V"},{"$f":"'Methods&Limits'!E37","v":"EN 1601"},{"$f":"'Methods&Limits'!F37","v":2017},{"$f":"'Methods&Limits'!G37","v":0.3},null,{"$f":"'Methods&Limits'!I37","v":3.177},{"$f":"IF(E31>G90,\"Yes\",\"\")","v":""}]
[{"$f":"'Methods&Limits'!A38","v":"-- Ethanol"},{"$f":"'Methods&Limits'!B38","v":"% V/V"},{"$f":"'Methods&Limits'!E38","v":"EN 1601"},{"$f":"'Methods&Limits'!F38","v":2017},{"$f":"'Methods&Limits'!G38","v":0.8},null,{"$f":"'Methods&Limits'!I38","v":10.472},""]
[{"$f":"'Methods&Limits'!A39","v":"-- Iso-propyl alcohol"},{"$f":"'Methods&Limits'!B39","v":"% V/V"},{"$f":"'Methods&Limits'!E39","v":"EN 1601"},{"$f":"'Methods&Limits'!F39","v":2017},{"$f":"'Methods&Limits'!G39","v":0.9},null,{"$f":"'Methods&Limits'!I39","v":12.531000000000001},""]
[{"$f":"'Methods&Limits'!A40","v":"-- Tert-butyl alcohol"},{"$f":"'Methods&Limits'!B40","v":"% V/V"},{"$f":"'Methods&Limits'!E40","v":"EN 1601"},{"$f":"'Methods&Limits'!F40","v":2017},{"$f":"'Methods&Limits'!G40","v":1},null,{"$f":"'Methods&Limits'!I40","v":15.59},""]
[{"$f":"'Methods&Limits'!A41","v":"-- Iso-butyl alcohol"},{"$f":"'Methods&Limits'!B41","v":"% V/V"},{"$f":"'Methods&Limits'!E41","v":"EN 1601"},{"$f":"'Methods&Limits'!F41","v":2017},{"$f":"'Methods&Limits'!G41","v":1},null,{"$f":"'Methods&Limits'!I41","v":15.59},""]
[{"$f":"'Methods&Limits'!A42","v":"-- Ethers with 5 or more carbon atoms per molecule"},{"$f":"'Methods&Limits'!B42","v":"% V/V"},{"$f":"'Methods&Limits'!E42","v":"EN 1601"},{"$f":"'Methods&Limits'!F42","v":2017},{"$f":"'Methods&Limits'!G42","v":1},null,{"$f":"'Methods&Limits'!I42","v":22.59},""]
[{"$f":"'Methods&Limits'!A43","v":"-- other oxygenates"},{"$f":"'Methods&Limits'!B43","v":"% V/V"},{"$f":"'Methods&Limits'!E43","v":"EN 1601"},{"$f":"'Methods&Limits'!F43","v":2017},{"$f":"'Methods&Limits'!G43","v":1},null,{"$f":"'Methods&Limits'!I43","v":15.59},""]
[{"$f":"'Methods&Limits'!A44","v":"Oxygen content"},{"$f":"'Methods&Limits'!B44","v":"% (m/m)"},{"$f":"'Methods&Limits'!E44","v":"EN 13132"},{"$f":"'Methods&Limits'!F44","v":2002},{"$f":"'Methods&Limits'!G44","v":0.3},null,{"$f":"'Methods&Limits'!I44","v":3.8770000000000002},{"$f":"IF(E28>G97,\"Yes\",\"\")","v":""}]
[null,null,{"$f":"'Methods&Limits'!E45","v":"EN 13132"},{"$f":"'Methods&Limits'!F45","v":2002},{"$f":"'Methods&Limits'!G45","v":0.3},null,{"$f":"'Methods&Limits'!I45","v":2.8770000000000002},{"$f":"IF(E29>G98,\"Yes\",\"\")","v":""}]
[{"$f":"'Methods&Limits'!A46","v":"Oxygenates"}]
[{"$f":"'Methods&Limits'!A47","v":"-- Methanol"},{"$f":"'Methods&Limits'!B47","v":"% V/V"},{"$f":"'Methods&Limits'!E47","v":"EN 13132"},{"$f":"'Methods&Limits'!F47","v":2002},{"$f":"'Methods&Limits'!G47","v":0.3},null,{"$f":"'Methods&Limits'!I47","v":3.177},{"$f":"IF(E31>G100,\"Yes\",\"\")","v":""}]
[{"$f":"'Methods&Limits'!A48","v":"-- Ethanol"},{"$f":"'Methods&Limits'!B48","v":"% V/V"},{"$f":"'Methods&Limits'!E48","v":"EN 13132"},{"$f":"'Methods&Limits'!F48","v":2002},{"$f":"'Methods&Limits'!G48","v":0.8},null,{"$f":"'Methods&Limits'!I48","v":10.472},""]
[{"$f":"'Methods&Limits'!A49","v":"-- Iso-propyl alcohol"},{"$f":"'Methods&Limits'!B49","v":"% V/V"},{"$f":"'Methods&Limits'!E49","v":"EN 13132"},{"$f":"'Methods&Limits'!F49","v":2002},{"$f":"'Methods&Limits'!G49","v":0.8},null,{"$f":"'Methods&Limits'!I49","v":12.472},""]
[{"$f":"'Methods&Limits'!A50","v":"-- Tert-butyl alcohol"},{"$f":"'Methods&Limits'!B50","v":"% V/V"},{"$f":"'Methods&Limits'!E50","v":"EN 13132"},{"$f":"'Methods&Limits'!F50","v":2002},{"$f":"'Methods&Limits'!G50","v":1},null,{"$f":"'Methods&Limits'!I50","v":15.59},""]
[{"$f":"'Methods&Limits'!A51","v":"-- Iso-butyl alcohol"},{"$f":"'Methods&Limits'!B51","v":"% V/V"},{"$f":"'Methods&Limits'!E51","v":"EN 13132"},{"$f":"'Methods&Limits'!F51","v":2002},{"$f":"'Methods&Limits'!G51","v":1},null,{"$f":"'Methods&Limits'!I51","v":15.59},""]
[{"$f":"'Methods&Limits'!A52","v":"-- Ethers with 5 or more carbon atoms per molecule"},{"$f":"'Methods&Limits'!B52","v":"% V/V"},{"$f":"'Methods&Limits'!E52","v":"EN 13132"},{"$f":"'Methods&Limits'!F52","v":2002},{"$f":"'Methods&Limits'!G52","v":1},null,{"$f":"'Methods&Limits'!I52","v":22.59},""]
[{"$f":"'Methods&Limits'!A53","v":"-- other oxygenates"},{"$f":"'Methods&Limits'!B53","v":"% V/V"},{"$f":"'Methods&Limits'!E53","v":"EN 13132"},{"$f":"'Methods&Limits'!F53","v":2002},{"$f":"'Methods&Limits'!G53","v":1},null,{"$f":"'Methods&Limits'!I53","v":15.59},""]
[{"$f":"'Methods&Limits'!A54","v":"Oxygen content"},{"$f":"'Methods&Limits'!B54","v":"% (m/m)"},{"$f":"'Methods&Limits'!E54","v":"EN-ISO 22854"},{"$f":"'Methods&Limits'!F54","v":2021},{"$f":"'Methods&Limits'!G54","v":0.4},null,{"$f":"'Methods&Limits'!I54","v":3.9359999999999999},{"$f":"IF(E28>G107,\"Yes\",\"\")","v":""}]
[null,null,{"$f":"'Methods&Limits'!E55","v":"EN-ISO 22854"},{"$f":"'Methods&Limits'!F55","v":2021},{"$f":"'Methods&Limits'!G55","v":0.4},null,{"$f":"'Methods&Limits'!I55","v":2.9359999999999999},{"$f":"IF(E29>G108,\"Yes\",\"\")","v":""}]
[{"$f":"'Methods&Limits'!A56","v":"Oxyginates"}]
[{"$f":"'Methods&Limits'!A57","v":"-- Methanol"},{"$f":"'Methods&Limits'!B57","v":"% V/V"},{"$f":"'Methods&Limits'!E57","v":"EN-ISO 22854"},{"$f":"'Methods&Limits'!F57","v":2021},{"$f":"'Methods&Limits'!G57","v":0.4},null,{"$f":"'Methods&Limits'!I57","v":3.2359999999999998},{"$f":"IF(E31>G110,\"Yes\",\"\")","v":""}]
[{"$f":"'Methods&Limits'!A58","v":"-- Ethanol"},{"$f":"'Methods&Limits'!B58","v":"% V/V"},{"$f":"'Methods&Limits'!E58","v":"EN-ISO 22854"},{"$f":"'Methods&Limits'!F58","v":2021},{"$f":"'Methods&Limits'!G58","v":0.6},null,{"$f":"'Methods&Limits'!I58","v":10.353999999999999},""]
[{"$f":"'Methods&Limits'!A59","v":"-- Iso-propyl alcohol"},{"$f":"'Methods&Limits'!B59","v":"% V/V"},{"$f":"'Methods&Limits'!E59","v":"EN-ISO 22854"},{"$f":"'Methods&Limits'!F59","v":2021},{"$f":"'Methods&Limits'!G59","v":0.7},null,{"$f":"'Methods&Limits'!I59","v":12.413},""]
[{"$f":"'Methods&Limits'!A60","v":"-- Tert-butyl alcohol"},{"$f":"'Methods&Limits'!B60","v":"% V/V"},{"$f":"'Methods&Limits'!E60","v":"EN-ISO 22854"},{"$f":"'Methods&Limits'!F60","v":2021},{"$f":"'Methods&Limits'!G60","v":0.7},null,{"$f":"'Methods&Limits'!I60","v":15.413},""]
[{"$f":"'Methods&Limits'!A61","v":"-- Iso-butyl alcohol"},{"$f":"'Methods&Limits'!B61","v":"% V/V"},{"$f":"'Methods&Limits'!E61","v":"EN-ISO 22854"},{"$f":"'Methods&Limits'!F61","v":2021},{"$f":"'Methods&Limits'!G61","v":0.7},null,{"$f":"'Methods&Limits'!I61","v":15.413},""]
[{"$f":"'Methods&Limits'!A62","v":"-- Ethers with 5 or more carbon atoms per molecule"},{"$f":"'Methods&Limits'!B62","v":"% V/V"},{"$f":"'Methods&Limits'!E62","v":"EN-ISO 22854"},{"$f":"'Methods&Limits'!F62","v":2021},{"$f":"'Methods&Limits'!G62","v":0.9},null,{"$f":"'Methods&Limits'!I62","v":22.530999999999999},""]
[{"$f":"'Methods&Limits'!A63","v":"-- other oxygenates"},{"$f":"'Methods&Limits'!B63","v":"% V/V"},{"$f":"'Methods&Limits'!E63","v":"EN-ISO 22854"},{"$f":"'Methods&Limits'!F63","v":2021},{"$f":"'Methods&Limits'!G63","v":0.7},null,{"$f":"'Methods&Limits'!I63","v":15.413},""]
[{"$f":"'Methods&Limits'!A64:A64","v":"Sulphur content (sulphur free, from 2005)**"},{"$f":"'Methods&Limits'!B64","v":"mg/kg"},{"$f":"'Methods&Limits'!E64","v":"EN-ISO 14596"},{"$f":"'Methods&Limits'!F64","v":2018},{"$f":"'Methods&Limits'!G64","v":5},null,{"$f":"'Methods&Limits'!I64","v":12.95},{"$f":"IF(E$38>G117,\"Yes\",\"\")","v":""}]
[null,null,{"$f":"'Methods&Limits'!E65","v":"EN 24260"},{"$f":"'Methods&Limits'!F65","v":1994},{"$f":"'Methods&Limits'!G65","v":1},null,{"$f":"'Methods&Limits'!I65","v":10.59},{"$f":"IF(E$38>G118,\"Yes\",\"\")","v":""}]
[null,null,{"$f":"'Methods&Limits'!E66","v":"EN-ISO 20846"},{"$f":"'Methods&Limits'!F66","v":2019},{"$f":"'Methods&Limits'!G66","v":2.7},null,{"$f":"'Methods&Limits'!I66","v":11.593},{"$f":"IF(E$38>G119,\"Yes\",\"\")","v":""}]
[null,null,{"$f":"'Methods&Limits'!E67","v":"EN-ISO 20884"},{"$f":"'Methods&Limits'!F67","v":2019},{"$f":"'Methods&Limits'!G67","v":3.1},null,{"$f":"'Methods&Limits'!I67","v":11.829000000000001},{"$f":"IF(E$38>G120,\"Yes\",\"\")","v":""}]
[{"$f":"'Methods&Limits'!A68:A68","v":"Lead content"},{"$f":"'Methods&Limits'!B68","v":"g/l"},{"$f":"'Methods&Limits'!E68","v":"EN 237"},{"$f":"'Methods&Limits'!F68","v":2004},{"$f":"'Methods&Limits'!G68","v":6.1999999999999998E-3},null,{"$f":"'Methods&Limits'!I68","v":8.657999999999999E-3},{"$f":"IF($E$39>G121,\"Yes\",\"\")","v":""}]

{"sheet":"Petrol (9+10)","index":27,"n_rows":121,"n_cols":18,"rows_kept":121,"cut":false,"hidden":false,"merged":[[2,1,2,4],[2,6,9,16],[3,1,3,4],[4,1,4,4],[5,1,5,4],[6,1,6,4],[7,2,7,4],[13,2,14,10],[13,11,13,14],[13,15,13,16],[14,11,14,12],[14,13,14,14],[14,15,14,16],[58,2,58,8],[58,9,58,12],[20,15,22,15],[27,15,28,15],[27,16,28,16],[43,0,43,3],[44,4,45,11],[46,4,46,11],[47,4,47,11],[48,4,48,11],[49,4,49,11],[50,4,50,11],[53,0,53,11],[71,11,71,12],[59,5,59,6],[59,9,60,9],[61,11,61,12],[62,11,62,12],[63,11,63,12],[64,11,64,12],[66,11,66,12],[67,11,67,12],[68,11,68,12],[69,11,69,12],[70,11,70,12],[59,11,59,12],[85,11,85,12],[72,11,72,12],[74,11,74,12],[75,11,75,12],[77,11,77,12],[78,11,78,12],[79,11,79,12],[80,11,80,12],[81,11,81,12],[82,11,82,12],[83,11,83,12],[84,11,84,12],[99,11,99,12],[86,11,86,12],[87,11,87,12],[89,11,89,12],[90,11,90,12],[91,11,91,12],[92,11,92,12],[93,11,93,12],[94,11,94,12],[95,11,95,12],[96,11,96,12],[97,11,97,12],[112,11,112,12],[100,11,100,12],[101,11,101,12],[102,11,102,12],[103,11,103,12],[104,11,104,12],[105,11,105,12],[106,11,106,12],[107,11,107,12],[109,11,109,12],[110,11,110,12],[111,11,111,12],[119,11,119,12],[120,11,120,12],[121,11,121,12],[122,11,122,12],[113,11,113,12],[114,11,114,12],[115,11,115,12],[116,11,116,12],[117,11,117,12],[118,11,118,12]]}
["Market Fuels used in Vehicles with Spark Ignition Engines (Petrol)",null,null,null,null,null,null,null,null,null,null,null,null,null,null,null,null,"<-- GO BACK"]
[]
["Country",{"$f":"IF(LEN('Contacts&Annual Summary'!C9) > 1,'Contacts&Annual Summary'!C9,\"\")","v":""},null,null,null,null,"Notes on completing the tables\nThe table structure has been locked to prevent modification - data can be copied and pasted, in bulk into the Reporting Results blue table cells.  Where a white row exists between rows, it will not be possible to paste over white rows and sections should be pasted separately.\n\nColumn H in the Test Methods and Analysis table is set to automatically check whether the values entered in the Reporting Results table exceed maximum or minimum Tolerance Limits.  If any exceedance is detected, please provide details in the columns to the right including the number of samples, location samples were taken from, Values and Details of any action taken to address non-compliant samples.  Compliance information is verified manually and this automated compliance check is not solely relied upon during data analysis.\n\nPlease do not unlock this template - modified templates cannot be processed and may delay reporting."]
["Reporting Year",{"$f":"'Contacts&Annual Summary'!C8","v":2023}]
["Period (Summer or Winter)","Full Year"]
["Parent fuel grade","Petrol"]
["National fuel grade",{"$f":"'Petrol (9)'!B7","v":0}]
["Summer Period (N or A)*",0,{"$f":"IF( B8=\"A\",\"1st June to 31st August (arctic)\",\"1st May to 30th September (normal)\")","v":"1st May to 30th September (normal)"}]
["The maximum bioethanol content (% v/v)",{"$f":"MAX('Petrol (9)'!B9,'Petrol (10)'!B9)","v":0},"Please include the bioethanol content as a numerical figure in % V/V"]
["* N = 1st May to 30th September (normal) ; A = 1st June to 31st August (arctic)."]
[]
["Reporting results"]
[]
["Parameter","Unit","Analytical and statistical results \n(Please see an explanation and examples for new columns/ information required in Cells I15 to K37 on the Introduction & Instructions tab).",null,null,null,null,null,null,null,null,"Limiting Value (1)",null,null,null,"Test method"]
[null,null,null,null,null,null,null,null,null,null,null,"National Specification, if any",null,"According to Directive 2009/30/EC",null,"(more recent versions may also be used)"]
[null,null,"No Samples","Minimum","Maximum","Median","Mean","Standard Deviation","No Samples outside 95% tolerance limit","25% of Sample Value","75% of Sample Value","Minimum","Maximum","Minimum","Maximum","Method","Date"]
["Research Octane Number","--",{"$f":"IF(AND('Petrol (9)'!C17=\"\",'Petrol (10)'!C17=\"\"),\"\",'Petrol (9)'!C17+'Petrol (10)'!C17)","v":0},{"$f":"IF(AND('Petrol (9)'!D17=\"\",'Petrol (10)'!D17=\"\"),\"\",MIN('Petrol (9)'!D17,'Petrol (10)'!D17))","v":0},{"$f":"IF(AND('Petrol (9)'!E17=\"\",'Petrol (10)'!E17=\"\"),\"\",MAX('Petrol (9)'!E17,'Petrol (10)'!E17))","v":0},0,0,0,{"$f":"IF(AND('Petrol (9)'!I17=\"\",'Petrol (10)'!I17=\"\"),\"\",'Petrol (9)'!I17+'Petrol (10)'!I17)","v":0},0,0,null,null,"95 (2)",null,"EN-ISO 5164",2005]
["Motor Octane Number","--",{"$f":"IF(AND('Petrol (9)'!C18=\"\",'Petrol (10)'!C18=\"\"),\"\",'Petrol (9)'!C18+'Petrol (10)'!C18)","v":0},{"$f":"IF(AND('Petrol (9)'!D18=\"\",'Petrol (10)'!D18=\"\"),\"\",MIN('Petrol (9)'!D18,'Petrol (10)'!D18))","v":0},{"$f":"IF(AND('Petrol (9)'!E18=\"\",'Petrol (10)'!E18=\"\"),\"\",MAX('Petrol (9)'!E18,'Petrol (10)'!E18))","v":0},0,0,0,{"$f":"IF(AND('Petrol (9)'!I18=\"\",'Petrol (10)'!I18=\"\"),\"\",'Petrol (9)'!I18+'Petrol (10)'!I18)","v":0},0,0,null,null,"85 (3)",null,"EN-ISO 5163",2005]
["Vapour Pressure, DVPE (6)","kPa",null,null,null,null,null,null,null,null,null,null,null,null,"(4)"]
["-- required for summer period only",null,{"$f":"IF(AND('Petrol (9)'!C20=\"\",'Petrol (10)'!C20=\"\"),\"\",'Petrol (9)'!C20+'Petrol (10)'!C20)","v":0},{"$f":"IF(AND('Petrol (9)'!D20=\"\",'Petrol (10)'!D20=\"\"),\"\",MIN('Petrol (9)'!D20,'Petrol (10)'!D20))","v":0},{"$f":"IF(AND('Petrol (9)'!E20=\"\",'Petrol (10)'!E20=\"\"),\"\",MAX('Petrol (9)'!E20,'Petrol (10)'!E20))","v":0},0,0,0,{"$f":"IF(AND('Petrol (9)'!I20=\"\",'Petrol (10)'!I20=\"\"),\"\",'Petrol (9)'!I20+'Petrol (10)'!I20)","v":0},0,0,null,null,null,{"$f":"IF(E8=\"A\",70,60)","v":60},"EN 13106-1",2007]
["Distillation",null,null,null,null,null,null,null,null,null,null,null,null,null,null,"EN-ISO 3405"]
["-- evaporated at 100 oC","% V/V",{"$f":"IF(AND('Petrol (9)'!C22=\"\",'Petrol (10)'!C22=\"\"),\"\",'Petrol (9)'!C22+'Petrol (10)'!C22)","v":0},{"$f":"IF(AND('Petrol (9)'!D22=\"\",'Petrol (10)'!D22=\"\"),\"\",MIN('Petrol (9)'!D22,'Petrol (10)'!D22))","v":0},{"$f":"IF(AND('Petrol (9)'!E22=\"\",'Petrol (10)'!E22=\"\"),\"\",MAX('Petrol (9)'!E22,'Petrol (10)'!E22))","v":0},0,0,0,{"$f":"IF(AND('Petrol (9)'!I22=\"\",'Petrol (10)'!I22=\"\"),\"\",'Petrol (9)'!I22+'Petrol (10)'!I22)","v":0},0,0,null,null,46,null,null,2000]
["-- evaporated at 150 oC ","% V/V",{"$f":"IF(AND('Petrol (9)'!C23=\"\",'Petrol (10)'!C23=\"\"),\"\",'Petrol (9)'!C23+'Petrol (10)'!C23)","v":0},{"$f":"IF(AND('Petrol (9)'!D23=\"\",'Petrol (10)'!D23=\"\"),\"\",MIN('Petrol (9)'!D23,'Petrol (10)'!D23))","v":0},{"$f":"IF(AND('Petrol (9)'!E23=\"\",'Petrol (10)'!E23=\"\"),\"\",MAX('Petrol (9)'!E23,'Petrol (10)'!E23))","v":0},0,0,0,{"$f":"IF(AND('Petrol (9)'!I23=\"\",'Petrol (10)'!I23=\"\"),\"\",'Petrol (9)'!I23+'Petrol (10)'!I23)","v":0},0,0,null,null,75]
["Hydrocarbon analysis"]
["-- Olefins","% V/V",{"$f":"IF(AND('Petrol (9)'!C25=\"\",'Petrol (10)'!C25=\"\"),\"\",'Petrol (9)'!C25+'Petrol (10)'!C25)","v":0},{"$f":"IF(AND('Petrol (9)'!D25=\"\",'Petrol (10)'!D25=\"\"),\"\",MIN('Petrol (9)'!D25,'Petrol (10)'!D25))","v":0},{"$f":"IF(AND('Petrol (9)'!E25=\"\",'Petrol (10)'!E25=\"\"),\"\",MAX('Petrol (9)'!E25,'Petrol (10)'!E25))","v":0},0,0,0,{"$f":"IF(AND('Petrol (9)'!I25=\"\",'Petrol (10)'!I25=\"\"),\"\",'Petrol (9)'!I25+'Petrol (10)'!I25)","v":0},0,0,null,null,null,"18.0 (5)","ASTM D 1319\nEN 15553\nEN-ISO 22854","1995\n2007\n2008"]
["-- Aromatics","% V/V",{"$f":"IF(AND('Petrol (9)'!C26=\"\",'Petrol (10)'!C26=\"\"),\"\",'Petrol (9)'!C26+'Petrol (10)'!C26)","v":0},{"$f":"IF(AND('Petrol (9)'!D26=\"\",'Petrol (10)'!D26=\"\"),\"\",MIN('Petrol (9)'!D26,'Petrol (10)'!D26))","v":0},{"$f":"IF(AND('Petrol (9)'!E26=\"\",'Petrol (10)'!E26=\"\"),\"\",MAX('Petrol (9)'!E26,'Petrol (10)'!E26))","v":0},0,0,0,{"$f":"IF(AND('Petrol (9)'!I26=\"\",'Petrol (10)'!I26=\"\"),\"\",'Petrol (9)'!I26+'Petrol (10)'!I26)","v":0},0,0,null,null,null,35,"EN-ISO 22854","1995\n2008"]
["-- Benzene","% V/V",{"$f":"IF(AND('Petrol (9)'!C27=\"\",'Petrol (10)'!C27=\"\"),\"\",'Petrol (9)'!C27+'Petrol (10)'!C27)","v":0},{"$f":"IF(AND('Petrol (9)'!D27=\"\",'Petrol (10)'!D27=\"\"),\"\",MIN('Petrol (9)'!D27,'Petrol (10)'!D27))","v":0},{"$f":"IF(AND('Petrol (9)'!E27=\"\",'Petrol (10)'!E27=\"\"),\"\",MAX('Petrol (9)'!E27,'Petrol (10)'!E27))","v":0},0,0,0,{"$f":"IF(AND('Petrol (9)'!I27=\"\",'Petrol (10)'!I27=\"\"),\"\",'Petrol (9)'!I27+'Petrol (10)'!I27)","v":0},0,0,null,null,null,1,"EN 238\nEN 12177\nEN-ISO 22854","1996\n1998\n2008"]
[{"$f":"IF(C29>0,\"Do not complete\",\"Oxygen content\")","v":"Oxygen content"},"% (m/m)",{"$f":"IF(AND('Petrol (9)'!C28=\"\",'Petrol (10)'!C28=\"\"),\"\",'Petrol (9)'!C28+'Petrol (10)'!C28)","v":0},{"$f":"IF(AND('Petrol (9)'!D28=\"\",'Petrol (10)'!D28=\"\"),\"\",MIN('Petrol (9)'!D28,'Petrol (10)'!D28))","v":0},{"$f":"IF(AND('Petrol (9)'!E28=\"\",'Petrol (10)'!E28=\"\"),\"\",MAX('Petrol (9)'!E28,'Petrol (10)'!E28))","v":0},0,0,0,{"$f":"IF(AND('Petrol (9)'!I28=\"\",'Petrol (10)'!I28=\"\"),\"\",'Petrol (9)'!I28+'Petrol (10)'!I28)","v":0},0,0,null,null,null,3.7,"EN 1601\nEN 13132\nEN-ISO 22854","1997\n2000\n2008"]
[{"$f":"IF(C28>0,\"Do not complete\",\"Oxygen content*\n*petrol with 5% (v/v) or less ethanol content\")","v":"Oxygen content*\n*petrol with 5% (v/v) or less ethanol content"},"% (m/m)",{"$f":"IF(AND('Petrol (9)'!C29=\"\",'Petrol (10)'!C29=\"\"),\"\",'Petrol (9)'!C29+'Petrol (10)'!C29)","v":0},{"$f":"IF(AND('Petrol (9)'!D29=\"\",'Petrol (10)'!D29=\"\"),\"\",MIN('Petrol (9)'!D29,'Petrol (10)'!D29))","v":0},{"$f":"IF(AND('Petrol (9)'!E29=\"\",'Petrol (10)'!E29=\"\"),\"\",MAX('Petrol (9)'!E29,'Petrol (10)'!E29))","v":0},0,0,0,{"$f":"IF(AND('Petrol (9)'!I29=\"\",'Petrol (10)'!I29=\"\"),\"\",'Petrol (9)'!I29+'Petrol (10)'!I29)","v":0},0,0,null,null,null,2.7]
["Oxygenates"]
["-- Methanol","% V/V",{"$f":"IF(AND('Petrol (9)'!C31=\"\",'Petrol (10)'!C31=\"\"),\"\",'Petrol (9)'!C31+'Petrol (10)'!C31)","v":0},{"$f":"IF(AND('Petrol (9)'!D31=\"\",'Petrol (10)'!D31=\"\"),\"\",MIN('Petrol (9)'!D31,'Petrol (10)'!D31))","v":0},{"$f":"IF(AND('Petrol (9)'!E31=\"\",'Petrol (10)'!E31=\"\"),\"\",MAX('Petrol (9)'!E31,'Petrol (10)'!E31))","v":0},0,0,0,{"$f":"IF(AND('Petrol (9)'!I31=\"\",'Petrol (10)'!I31=\"\"),\"\",'Petrol (9)'!I31+'Petrol (10)'!I31)","v":0},0,0,null,null,null,3]
["-- Ethanol","% V/V",{"$f":"IF(AND('Petrol (9)'!C32=\"\",'Petrol (10)'!C32=\"\"),\"\",'Petrol (9)'!C32+'Petrol (10)'!C32)","v":0},{"$f":"IF(AND('Petrol (9)'!D32=\"\",'Petrol (10)'!D32=\"\"),\"\",MIN('Petrol (9)'!D32,'Petrol (10)'!D32))","v":0},{"$f":"IF(AND('Petrol (9)'!E32=\"\",'Petrol (10)'!E32=\"\"),\"\",MAX('Petrol (9)'!E32,'Petrol (10)'!E32))","v":0},0,0,0,{"$f":"IF(AND('Petrol (9)'!I32=\"\",'Petrol (10)'!I32=\"\"),\"\",'Petrol (9)'!I32+'Petrol (10)'!I32)","v":0},0,0,null,null,null,10]
["-- Iso-propyl alcohol","% V/V",{"$f":"IF(AND('Petrol (9)'!C33=\"\",'Petrol (10)'!C33=\"\"),\"\",'Petrol (9)'!C33+'Petrol (10)'!C33)","v":0},{"$f":"IF(AND('Petrol (9)'!D33=\"\",'Petrol (10)'!D33=\"\"),\"\",MIN('Petrol (9)'!D33,'Petrol (10)'!D33))","v":0},{"$f":"IF(AND('Petrol (9)'!E33=\"\",'Petrol (10)'!E33=\"\"),\"\",MAX('Petrol (9)'!E33,'Petrol (10)'!E33))","v":0},0,0,0,{"$f":"IF(AND('Petrol (9)'!I33=\"\",'Petrol (10)'!I33=\"\"),\"\",'Petrol (9)'!I33+'Petrol (10)'!I33)","v":0},0,0,null,null,null,12,"EN 1601",1997]
["-- Tert-butyl alcohol","% V/V",{"$f":"IF(AND('Petrol (9)'!C34=\"\",'Petrol (10)'!C34=\"\"),\"\",'Petrol (9)'!C34+'Petrol (10)'!C34)","v":0},{"$f":"IF(AND('Petrol (9)'!D34=\"\",'Petrol (10)'!D34=\"\"),\"\",MIN('Petrol (9)'!D34,'Petrol (10)'!D34))","v":0},{"$f":"IF(AND('Petrol (9)'!E34=\"\",'Petrol (10)'!E34=\"\"),\"\",MAX('Petrol (9)'!E34,'Petrol (10)'!E34))","v":0},0,0,0,{"$f":"IF(AND('Petrol (9)'!I34=\"\",'Petrol (10)'!I34=\"\"),\"\",'Petrol (9)'!I34+'Petrol (10)'!I34)","v":0},0,0,null,null,null,15,"EN 13132",2000]
["-- Iso-butyl alcohol","% V/V",{"$f":"IF(AND('Petrol (9)'!C35=\"\",'Petrol (10)'!C35=\"\"),\"\",'Petrol (9)'!C35+'Petrol (10)'!C35)","v":0},{"$f":"IF(AND('Petrol (9)'!D35=\"\",'Petrol (10)'!D35=\"\"),\"\",MIN('Petrol (9)'!D35,'Petrol (10)'!D35))","v":0},{"$f":"IF(AND('Petrol (9)'!E35=\"\",'Petrol (10)'!E35=\"\"),\"\",MAX('Petrol (9)'!E35,'Petrol (10)'!E35))","v":0},0,0,0,{"$f":"IF(AND('Petrol (9)'!I35=\"\",'Petrol (10)'!I35=\"\"),\"\",'Petrol (9)'!I35+'Petrol (10)'!I35)","v":0},0,0,null,null,null,15,"EN-ISO 22854",2008]
["-- Ethers with ≥5 carbon atoms / molecule","% V/V",{"$f":"IF(AND('Petrol (9)'!C36=\"\",'Petrol (10)'!C36=\"\"),\"\",'Petrol (9)'!C36+'Petrol (10)'!C36)","v":0},{"$f":"IF(AND('Petrol (9)'!D36=\"\",'Petrol (10)'!D36=\"\"),\"\",MIN('Petrol (9)'!D36,'Petrol (10)'!D36))","v":0},{"$f":"IF(AND('Petrol (9)'!E36=\"\",'Petrol (10)'!E36=\"\"),\"\",MAX('Petrol (9)'!E36,'Petrol (10)'!E36))","v":0},0,0,0,{"$f":"IF(AND('Petrol (9)'!I36=\"\",'Petrol (10)'!I36=\"\"),\"\",'Petrol (9)'!I36+'Petrol (10)'!I36)","v":0},0,0,null,null,null,22]
["-- other oxygenates","% V/V",{"$f":"IF(AND('Petrol (9)'!C37=\"\",'Petrol (10)'!C37=\"\"),\"\",'Petrol (9)'!C37+'Petrol (10)'!C37)","v":0},{"$f":"IF(AND('Petrol (9)'!D37=\"\",'Petrol (10)'!D37=\"\"),\"\",MIN('Petrol (9)'!D37,'Petrol (10)'!D37))","v":0},{"$f":"IF(AND('Petrol (9)'!E37=\"\",'Petrol (10)'!E37=\"\"),\"\",MAX('Petrol (9)'!E37,'Petrol (10)'!E37))","v":0},0,0,0,{"$f":"IF(AND('Petrol (9)'!I37=\"\",'Petrol (10)'!I37=\"\"),\"\",'Petrol (9)'!I37+'Petrol (10)'!I37)","v":0},0,0,null,null,null,15]
["Sulphur content","mg/kg",{"$f":"IF(AND('Petrol (9)'!C38=\"\",'Petrol (10)'!C38=\"\"),\"\",'Petrol (9)'!C38+'Petrol (10)'!C38)","v":0},{"$f":"IF(AND('Petrol (9)'!D38=\"\",'Petrol (10)'!D38=\"\"),\"\",MIN('Petrol (9)'!D38,'Petrol (10)'!D38))","v":0},{"$f":"IF(AND('Petrol (9)'!E38=\"\",'Petrol (10)'!E38=\"\"),\"\",MAX('Petrol (9)'!E38,'Petrol (10)'!E38))","v":0},0,0,0,{"$f":"IF(AND('Petrol (9)'!I38=\"\",'Petrol (10)'!I38=\"\"),\"\",'Petrol (9)'!I38+'Petrol (10)'!I38)","v":0},0,0,null,null,null,10,"EN-ISO 14596\nEN 24260\nEN-ISO 20846\nEN-ISO 20884","1998\n1994\n2004\n2004"]
["Lead content","g/l",{"$f":"IF(AND('Petrol (9)'!C39=\"\",'Petrol (10)'!C39=\"\"),\"\",'Petrol (9)'!C39+'Petrol (10)'!C39)","v":0},{"$f":"IF(AND('Petrol (9)'!D39=\"\",'Petrol (10)'!D39=\"\"),\"\",MIN('Petrol (9)'!D39,'Petrol (10)'!D39))","v":0},{"$f":"IF(AND('Petrol (9)'!E39=\"\",'Petrol (10)'!E39=\"\"),\"\",MAX('Petrol (9)'!E39,'Petrol (10)'!E39))","v":0},0,0,0,{"$f":"IF(AND('Petrol (9)'!I39=\"\",'Petrol (10)'!I39=\"\"),\"\",'Petrol (9)'!I39+'Petrol (10)'!I39)","v":0},0,0,null,null,null,5.0000000000000001E-3,"EN 237",1996]
[]
[]
["Sampling frequency"]
[]
["Number of samples in month"]
["January",{"$f":"'Petrol (9)'!B45+'Petrol (10)'!B45","v":0},"July",{"$f":"'Petrol (9)'!D45+'Petrol (10)'!D45","v":0},"(1) The limiting values are \"true values\" and were established according to the procedures for limit setting in EN 228:2008  The results of individual measurements shall be interpreted following the criteria described in EN 228:2008."]
["February",{"$f":"'Petrol (9)'!B46+'Petrol (10)'!B46","v":0},"August",{"$f":"'Petrol (9)'!D46+'Petrol (10)'!D46","v":0}]
["March",{"$f":"'Petrol (9)'!B47+'Petrol (10)'!B47","v":0},"September",{"$f":"'Petrol (9)'!D47+'Petrol (10)'!D47","v":0},"(2) 91 for unleaded regular grade petrol: See 2009/30/EC Annex I, Footnote 3."]
["April",{"$f":"'Petrol (9)'!B48+'Petrol (10)'!B48","v":0},"October",{"$f":"'Petrol (9)'!D48+'Petrol (10)'!D48","v":0},"(3) 81 for unleaded regular grade petrol: See 2009/30/EC Annex I, Footnote 3."]
["May",{"$f":"'Petrol (9)'!B49+'Petrol (10)'!B49","v":0},"November",{"$f":"'Petrol (9)'!D49+'Petrol (10)'!D49","v":0},"(4) 70 kPa for Member States with arctic or severe weather conditions: See 2003/30/EC Annex I, Footnotes 4 & 5."]
["June",{"$f":"'Petrol (9)'!B50+'Petrol (10)'!B50","v":0},"December",{"$f":"'Petrol (9)'!D50+'Petrol (10)'!D50","v":0},"(5) 21 for unleaded regular grade petrol: See 98/70/EC, Annex I, Footnote 6."]
[null,null,"Full YearTotal",{"$f":"SUM(B45:B50,D45:D50)","v":0},"(6) Vapour pressure waiver applies for petrol containing Bioethanol, see 2009/30/EC Annex I, Footnote 5 and Annex III."]
[]
["Other notes (optional):"]
[]
[]
[]
["Test Methods and Analysis",null,null,null,null,null,null,null,"Only if not provided in Summer and Winter sheets"]
[]
["Parameter","Unit","Test specified in 2009/30/EC or EN228:2008",null,null,null,null,null,null,"Notes on exceedences"]
[null,null,"Method","Date","Reproducability, R","Tolerance limits",null,null,null,"Sample location (S,T or R)","Values","Details/action taken"]
[null,null,null,null,null,"Minimum","Maximum","Exceeded?"]
[{"$f":"'Methods&Limits'!A9","v":"Research Octane Number (RON)"},{"$f":"'Methods&Limits'!B9","v":"--"},{"$f":"'Methods&Limits'!E9","v":"EN-ISO 5164"},{"$f":"'Methods&Limits'!F9","v":2014},{"$f":"'Methods&Limits'!G9","v":0.7},{"$f":"'Methods&Limits'!H9","v":94.587000000000003},null,{"$f":"IF(D17=\"\",\"\",IF(D17<F62,\"Yes\",\"\"))","v":"Yes"}]
[{"$f":"'Methods&Limits'!A10","v":"(RON 91 fuel only)"},{"$f":"'Methods&Limits'!B10","v":"--"},{"$f":"'Methods&Limits'!E10","v":"EN-ISO 5164"},{"$f":"'Methods&Limits'!F10","v":2014},{"$f":"'Methods&Limits'!G10","v":0.7},{"$f":"'Methods&Limits'!H10","v":90.587000000000003},null,{"$f":"IF(D17=\"\",\"\",IF(D17<F63,\"Yes\",\"\"))","v":"Yes"}]
[{"$f":"'Methods&Limits'!A11","v":"Motor Octane Number (MON)"},{"$f":"'Methods&Limits'!B11","v":"--"},{"$f":"'Methods&Limits'!E11","v":"EN-ISO 5163"},{"$f":"'Methods&Limits'!F11","v":2014},{"$f":"'Methods&Limits'!G11","v":0.9},{"$f":"'Methods&Limits'!H11","v":84.468999999999994},null,{"$f":"IF(D18=\"\",\"\",IF(D18<F64,\"Yes\",\"\"))","v":"Yes"}]
[{"$f":"'Methods&Limits'!A12","v":"(RON 91 fuel only)"},{"$f":"'Methods&Limits'!B12","v":"--"},{"$f":"'Methods&Limits'!E12","v":"EN-ISO 5163"},{"$f":"'Methods&Limits'!F12","v":2014},{"$f":"'Methods&Limits'!G12","v":0.9},{"$f":"'Methods&Limits'!H12","v":80.468999999999994},null,{"$f":"IF(D18=\"\",\"\",IF(D18<F65,\"Yes\",\"\"))","v":"Yes"}]
[{"$f":"'Methods&Limits'!A13","v":"Vapour Pressure, DVPE"}]
[{"$f":"'Methods&Limits'!A14","v":"--summer period (normal)"},{"$f":"'Methods&Limits'!B14","v":"kPa"},{"$f":"'Methods&Limits'!E14","v":"EN 13016-1"},{"$f":"'Methods&Limits'!F14","v":2018},{"$f":"'Methods&Limits'!G14","v":2.2000000000000002},null,{"$f":"'Methods&Limits'!I14","v":61.298000000000002},{"$f":"IF(E$20=\"\",\"\",IF(E$20>G67,\"Yes\",\"\"))","v":""}]
[{"$f":"'Methods&Limits'!A15","v":"-- Petrol with bioethanol content 0-2"},{"$f":"'Methods&Limits'!B15","v":"kPa"},{"$f":"'Methods&Limits'!E15","v":"EN 1601"},{"$f":"'Methods&Limits'!F15","v":2017},{"$f":"'Methods&Limits'!G15","v":2.2999999999999998},null,{"$f":"'Methods&Limits'!I15","v":67.307000000000002},{"$f":"IF(E$20=\"\",\"\",IF(E$20>G68,\"Yes\",\"\"))","v":""}]
[{"$f":"'Methods&Limits'!A16","v":"-- Petrol with bioethanol content 2-4"},{"$f":"'Methods&Limits'!B16","v":"kPa"},{"$f":"'Methods&Limits'!E16","v":"EN 1601"},{"$f":"'Methods&Limits'!F16","v":2017},{"$f":"'Methods&Limits'!G16","v":2.2999999999999998},null,{"$f":"'Methods&Limits'!I16","v":69.156999999999996},""]
[{"$f":"'Methods&Limits'!A17","v":"-- Petrol with bioethanol content 4-6"},{"$f":"'Methods&Limits'!B17","v":"kPa"},{"$f":"'Methods&Limits'!E17","v":"EN 1601"},{"$f":"'Methods&Limits'!F17","v":2017},{"$f":"'Methods&Limits'!G17","v":2.2999999999999998},null,{"$f":"'Methods&Limits'!I17","v":69.356999999999999},""]
[{"$f":"'Methods&Limits'!A18","v":"-- Petrol with bioethanol content 6-8"},{"$f":"'Methods&Limits'!B18","v":"kPa"},{"$f":"'Methods&Limits'!E18","v":"EN 1601"},{"$f":"'Methods&Limits'!F18","v":2017},{"$f":"'Methods&Limits'!G18","v":2.2999999999999998},null,{"$f":"'Methods&Limits'!I18","v":69.236999999999995},""]
[{"$f":"'Methods&Limits'!A19","v":"-- Petrol with bioethanol content 8-10"},{"$f":"'Methods&Limits'!B19","v":"kPa"},{"$f":"'Methods&Limits'!E19","v":"EN 1601"},{"$f":"'Methods&Limits'!F19","v":2017},{"$f":"'Methods&Limits'!G19","v":2.2999999999999998},null,{"$f":"'Methods&Limits'!I19","v":69.117000000000004},""]
[{"$f":"'Methods&Limits'!A20","v":"--summer period (arctic or severe weather conditions)"},{"$f":"'Methods&Limits'!B20","v":"kPa"},{"$f":"'Methods&Limits'!E20","v":"EN 13016-1"},{"$f":"'Methods&Limits'!F20","v":2018},{"$f":"'Methods&Limits'!G20","v":2.2999999999999998},null,{"$f":"'Methods&Limits'!I20","v":71.356999999999999},""]
[{"$f":"'Methods&Limits'!A21","v":"Distillation *"}]
[{"$f":"'Methods&Limits'!A22","v":"--evaporated at 100 oC"},{"$f":"'Methods&Limits'!B22","v":"% V/V"},{"$f":"'Methods&Limits'!E22","v":"EN-ISO 3405"},{"$f":"'Methods&Limits'!F22","v":2020},{"$f":"'Methods&Limits'!G22","v":4},{"$f":"'Methods&Limits'!H22","v":43.64},null,{"$f":"IF(D22=\"\",\"\",IF(D22<F75,\"Yes\",\"\"))","v":"Yes"}]
[{"$f":"'Methods&Limits'!A23","v":"-- evaporated at 150 oC "},{"$f":"'Methods&Limits'!B23","v":"% V/V"},{"$f":"'Methods&Limits'!E23","v":"EN-ISO 3405"},{"$f":"'Methods&Limits'!F23","v":2020},{"$f":"'Methods&Limits'!G23","v":4},{"$f":"'Methods&Limits'!H23","v":72.64},null,{"$f":"IF(D23=\"\",\"\",IF(D23<F76,\"Yes\",\"\"))","v":"Yes"}]
[{"$f":"'Methods&Limits'!A24","v":"Hydrocarbon analysis"},null,null,null,null,null,null,{"$f":"IF(D24<F77,\"Yes\",\"\")","v":""}]
[{"$f":"'Methods&Limits'!A25","v":"-- Olefins"},{"$f":"'Methods&Limits'!B25","v":"% V/V"},{"$f":"'Methods&Limits'!E25","v":"EN 15553"},{"$f":"'Methods&Limits'!F25","v":2021},{"$f":"'Methods&Limits'!G25","v":6.4},null,{"$f":"'Methods&Limits'!I25","v":21.776},{"$f":"IF(E$25=\"\",\"\",IF(E$25>G78,\"Yes\",\"\"))","v":""}]
[null,null,{"$f":"'Methods&Limits'!E26","v":"EN-ISO 22854"},{"$f":"'Methods&Limits'!F26","v":2021},{"$f":"'Methods&Limits'!G26","v":2.6},null,{"$f":"'Methods&Limits'!I26","v":19.533999999999999},{"$f":"IF(E$25=\"\",\"\",IF(E$25>G79,\"Yes\",\"\"))","v":""}]
[{"$f":"'Methods&Limits'!A27","v":"*without oxygenates"},null,{"$f":"'Methods&Limits'!E27","v":"EN 15553"},{"$f":"'Methods&Limits'!F27","v":2021},{"$f":"'Methods&Limits'!G27","v":"-"},null,{"$f":"'Methods&Limits'!I27","v":"-"},{"$f":"IF(E$25=\"\",\"\",IF(E$25>G80,\"Yes\",\"\"))","v":""}]
[null,null,{"$f":"'Methods&Limits'!E28","v":"EN-ISO 22854"},{"$f":"'Methods&Limits'!F28","v":2021},{"$f":"'Methods&Limits'!G28","v":"-"},null,{"$f":"'Methods&Limits'!I28","v":"-"},{"$f":"IF(E$25=\"\",\"\",IF(E$25>G81,\"Yes\",\"\"))","v":""}]
[{"$f":"'Methods&Limits'!A29","v":"-- Olefins (RON 91 fuel only)***"},{"$f":"'Methods&Limits'!B29","v":"% V/V"},{"$f":"'Methods&Limits'!E29","v":"ASTM D1319"},{"$f":"'Methods&Limits'!F29","v":2020},{"$f":"'Methods&Limits'!G29","v":5.0999999999999996},null,{"$f":"'Methods&Limits'!I29","v":24.009},{"$f":"IF(E$25=\"\",\"\",IF(E$25>G82,\"Yes\",\"\"))","v":""}]
[{"$f":"'Methods&Limits'!A30","v":"-- Aromatics (from 2005)"},null,{"$f":"'Methods&Limits'!E30","v":"EN-ISO 22854"},{"$f":"'Methods&Limits'!F30","v":2021},{"$f":"'Methods&Limits'!G30","v":1.7},null,{"$f":"'Methods&Limits'!I30","v":36.003},{"$f":"IF(E$26=\"\",\"\",IF(E$26>G83,\"Yes\",\"\"))","v":""}]
[{"$f":"'Methods&Limits'!A31","v":"-- Benzene"},{"$f":"'Methods&Limits'!B31","v":"% V/V"},{"$f":"'Methods&Limits'!E31","v":"EN 12177"},{"$f":"'Methods&Limits'!F31","v":2022},{"$f":"'Methods&Limits'!G31","v":0.1},null,{"$f":"'Methods&Limits'!I31","v":1.0589999999999999},{"$f":"IF(E$27=\"\",\"\",IF(E$27>G84,\"Yes\",\"\"))","v":""}]
[null,null,{"$f":"'Methods&Limits'!E32","v":"EN 238"},{"$f":"'Methods&Limits'!F32","v":1996},{"$f":"'Methods&Limits'!G32","v":0.17},null,{"$f":"'Methods&Limits'!I32","v":1.1003000000000001},{"$f":"IF(E$27=\"\",\"\",IF(E$27>G85,\"Yes\",\"\"))","v":""}]
[null,null,{"$f":"'Methods&Limits'!E33","v":"EN-ISO 22854"},{"$f":"'Methods&Limits'!F33","v":2021},{"$f":"'Methods&Limits'!G33","v":0.05},null,{"$f":"'Methods&Limits'!I33","v":1.0295000000000001},{"$f":"IF(E$27=\"\",\"\",IF(E$27>G86,\"Yes\",\"\"))","v":""}]
[{"$f":"'Methods&Limits'!A34","v":"Oxygen content"},{"$f":"'Methods&Limits'!B34","v":"% (m/m)"},{"$f":"'Methods&Limits'!E34","v":"EN 1601"},{"$f":"'Methods&Limits'!F34","v":2017},{"$f":"'Methods&Limits'!G34","v":0.41},null,{"$f":"'Methods&Limits'!I34","v":3.9419},{"$f":"IF(E$27=\"\",\"\",IF(E$27>G87,\"Yes\",\"\"))","v":""}]
[null,null,{"$f":"'Methods&Limits'!E35","v":"EN 1601"},{"$f":"'Methods&Limits'!F35","v":2017},{"$f":"'Methods&Limits'!G35","v":0.41},null,{"$f":"'Methods&Limits'!I35","v":2.9419},{"$f":"IF(E$27=\"\",\"\",IF(E$27>G88,\"Yes\",\"\"))","v":""}]
[{"$f":"'Methods&Limits'!A36","v":"Oxygenates"}]
[{"$f":"'Methods&Limits'!A37","v":"-- Methanol"},{"$f":"'Methods&Limits'!B37","v":"% V/V"},{"$f":"'Methods&Limits'!E37","v":"EN 1601"},{"$f":"'Methods&Limits'!F37","v":2017},{"$f":"'Methods&Limits'!G37","v":0.3},null,{"$f":"'Methods&Limits'!I37","v":3.177},{"$f":"IF(E31=\"\",\"\",IF(E31>G90,\"Yes\",\"\"))","v":""}]
[{"$f":"'Methods&Limits'!A38","v":"-- Ethanol"},{"$f":"'Methods&Limits'!B38","v":"% V/V"},{"$f":"'Methods&Limits'!E38","v":"EN 1601"},{"$f":"'Methods&Limits'!F38","v":2017},{"$f":"'Methods&Limits'!G38","v":0.8},null,{"$f":"'Methods&Limits'!I38","v":10.472},""]
[{"$f":"'Methods&Limits'!A39","v":"-- Iso-propyl alcohol"},{"$f":"'Methods&Limits'!B39","v":"% V/V"},{"$f":"'Methods&Limits'!E39","v":"EN 1601"},{"$f":"'Methods&Limits'!F39","v":2017},{"$f":"'Methods&Limits'!G39","v":0.9},null,{"$f":"'Methods&Limits'!I39","v":12.531000000000001},""]
[{"$f":"'Methods&Limits'!A40","v":"-- Tert-butyl alcohol"},{"$f":"'Methods&Limits'!B40","v":"% V/V"},{"$f":"'Methods&Limits'!E40","v":"EN 1601"},{"$f":"'Methods&Limits'!F40","v":2017},{"$f":"'Methods&Limits'!G40","v":1},null,{"$f":"'Methods&Limits'!I40","v":15.59},""]
[{"$f":"'Methods&Limits'!A41","v":"-- Iso-butyl alcohol"},{"$f":"'Methods&Limits'!B41","v":"% V/V"},{"$f":"'Methods&Limits'!E41","v":"EN 1601"},{"$f":"'Methods&Limits'!F41","v":2017},{"$f":"'Methods&Limits'!G41","v":1},null,{"$f":"'Methods&Limits'!I41","v":15.59},""]
[{"$f":"'Methods&Limits'!A42","v":"-- Ethers with 5 or more carbon atoms per molecule"},{"$f":"'Methods&Limits'!B42","v":"% V/V"},{"$f":"'Methods&Limits'!E42","v":"EN 1601"},{"$f":"'Methods&Limits'!F42","v":2017},{"$f":"'Methods&Limits'!G42","v":1},null,{"$f":"'Methods&Limits'!I42","v":22.59},""]
[{"$f":"'Methods&Limits'!A43","v":"-- other oxygenates"},{"$f":"'Methods&Limits'!B43","v":"% V/V"},{"$f":"'Methods&Limits'!E43","v":"EN 1601"},{"$f":"'Methods&Limits'!F43","v":2017},{"$f":"'Methods&Limits'!G43","v":1},null,{"$f":"'Methods&Limits'!I43","v":15.59},""]
[{"$f":"'Methods&Limits'!A44","v":"Oxygen content"},{"$f":"'Methods&Limits'!B44","v":"% (m/m)"},{"$f":"'Methods&Limits'!E44","v":"EN 13132"},{"$f":"'Methods&Limits'!F44","v":2002},{"$f":"'Methods&Limits'!G44","v":0.3},null,{"$f":"'Methods&Limits'!I44","v":3.8770000000000002},{"$f":"IF(E28=\"\",\"\",IF(E28>G97,\"Yes\",\"\"))","v":""}]
[null,null,{"$f":"'Methods&Limits'!E45","v":"EN 13132"},{"$f":"'Methods&Limits'!F45","v":2002},{"$f":"'Methods&Limits'!G45","v":0.3},null,{"$f":"'Methods&Limits'!I45","v":2.8770000000000002},{"$f":"IF(E29=\"\",\"\",IF(E29>G98,\"Yes\",\"\"))","v":""}]
[{"$f":"'Methods&Limits'!A46","v":"Oxygenates"}]
[{"$f":"'Methods&Limits'!A47","v":"-- Methanol"},{"$f":"'Methods&Limits'!B47","v":"% V/V"},{"$f":"'Methods&Limits'!E47","v":"EN 13132"},{"$f":"'Methods&Limits'!F47","v":2002},{"$f":"'Methods&Limits'!G47","v":0.3},null,{"$f":"'Methods&Limits'!I47","v":3.177},{"$f":"IF(E31=\"\",\"\",IF(E31>G100,\"Yes\",\"\"))","v":""}]
[{"$f":"'Methods&Limits'!A48","v":"-- Ethanol"},{"$f":"'Methods&Limits'!B48","v":"% V/V"},{"$f":"'Methods&Limits'!E48","v":"EN 13132"},{"$f":"'Methods&Limits'!F48","v":2002},{"$f":"'Methods&Limits'!G48","v":0.8},null,{"$f":"'Methods&Limits'!I48","v":10.472},""]
[{"$f":"'Methods&Limits'!A49","v":"-- Iso-propyl alcohol"},{"$f":"'Methods&Limits'!B49","v":"% V/V"},{"$f":"'Methods&Limits'!E49","v":"EN 13132"},{"$f":"'Methods&Limits'!F49","v":2002},{"$f":"'Methods&Limits'!G49","v":0.8},null,{"$f":"'Methods&Limits'!I49","v":12.472},""]
[{"$f":"'Methods&Limits'!A50","v":"-- Tert-butyl alcohol"},{"$f":"'Methods&Limits'!B50","v":"% V/V"},{"$f":"'Methods&Limits'!E50","v":"EN 13132"},{"$f":"'Methods&Limits'!F50","v":2002},{"$f":"'Methods&Limits'!G50","v":1},null,{"$f":"'Methods&Limits'!I50","v":15.59},""]
[{"$f":"'Methods&Limits'!A51","v":"-- Iso-butyl alcohol"},{"$f":"'Methods&Limits'!B51","v":"% V/V"},{"$f":"'Methods&Limits'!E51","v":"EN 13132"},{"$f":"'Methods&Limits'!F51","v":2002},{"$f":"'Methods&Limits'!G51","v":1},null,{"$f":"'Methods&Limits'!I51","v":15.59},""]
[{"$f":"'Methods&Limits'!A52","v":"-- Ethers with 5 or more carbon atoms per molecule"},{"$f":"'Methods&Limits'!B52","v":"% V/V"},{"$f":"'Methods&Limits'!E52","v":"EN 13132"},{"$f":"'Methods&Limits'!F52","v":2002},{"$f":"'Methods&Limits'!G52","v":1},null,{"$f":"'Methods&Limits'!I52","v":22.59},""]
[{"$f":"'Methods&Limits'!A53","v":"-- other oxygenates"},{"$f":"'Methods&Limits'!B53","v":"% V/V"},{"$f":"'Methods&Limits'!E53","v":"EN 13132"},{"$f":"'Methods&Limits'!F53","v":2002},{"$f":"'Methods&Limits'!G53","v":1},null,{"$f":"'Methods&Limits'!I53","v":15.59},""]
[{"$f":"'Methods&Limits'!A54","v":"Oxygen content"},{"$f":"'Methods&Limits'!B54","v":"% (m/m)"},{"$f":"'Methods&Limits'!E54","v":"EN-ISO 22854"},{"$f":"'Methods&Limits'!F54","v":2021},{"$f":"'Methods&Limits'!G54","v":0.4},null,{"$f":"'Methods&Limits'!I54","v":3.9359999999999999},{"$f":"IF(E28=\"\",\"\",IF(E28>G107,\"Yes\",\"\"))","v":""}]
[null,null,{"$f":"'Methods&Limits'!E55","v":"EN-ISO 22854"},{"$f":"'Methods&Limits'!F55","v":2021},{"$f":"'Methods&Limits'!G55","v":0.4},null,{"$f":"'Methods&Limits'!I55","v":2.9359999999999999},{"$f":"IF(E29=\"\",\"\",IF(E29>G108,\"Yes\",\"\"))","v":""}]
[{"$f":"'Methods&Limits'!A56","v":"Oxyginates"}]
[{"$f":"'Methods&Limits'!A57","v":"-- Methanol"},{"$f":"'Methods&Limits'!B57","v":"% V/V"},{"$f":"'Methods&Limits'!E57","v":"EN-ISO 22854"},{"$f":"'Methods&Limits'!F57","v":2021},{"$f":"'Methods&Limits'!G57","v":0.4},null,{"$f":"'Methods&Limits'!I57","v":3.2359999999999998},{"$f":"IF(E31=\"\",\"\",IF(E31>G110,\"Yes\",\"\"))","v":""}]
[{"$f":"'Methods&Limits'!A58","v":"-- Ethanol"},{"$f":"'Methods&Limits'!B58","v":"% V/V"},{"$f":"'Methods&Limits'!E58","v":"EN-ISO 22854"},{"$f":"'Methods&Limits'!F58","v":2021},{"$f":"'Methods&Limits'!G58","v":0.6},null,{"$f":"'Methods&Limits'!I58","v":10.353999999999999},""]
[{"$f":"'Methods&Limits'!A59","v":"-- Iso-propyl alcohol"},{"$f":"'Methods&Limits'!B59","v":"% V/V"},{"$f":"'Methods&Limits'!E59","v":"EN-ISO 22854"},{"$f":"'Methods&Limits'!F59","v":2021},{"$f":"'Methods&Limits'!G59","v":0.7},null,{"$f":"'Methods&Limits'!I59","v":12.413},""]
[{"$f":"'Methods&Limits'!A60","v":"-- Tert-butyl alcohol"},{"$f":"'Methods&Limits'!B60","v":"% V/V"},{"$f":"'Methods&Limits'!E60","v":"EN-ISO 22854"},{"$f":"'Methods&Limits'!F60","v":2021},{"$f":"'Methods&Limits'!G60","v":0.7},null,{"$f":"'Methods&Limits'!I60","v":15.413},""]
[{"$f":"'Methods&Limits'!A61","v":"-- Iso-butyl alcohol"},{"$f":"'Methods&Limits'!B61","v":"% V/V"},{"$f":"'Methods&Limits'!E61","v":"EN-ISO 22854"},{"$f":"'Methods&Limits'!F61","v":2021},{"$f":"'Methods&Limits'!G61","v":0.7},null,{"$f":"'Methods&Limits'!I61","v":15.413},""]
[{"$f":"'Methods&Limits'!A62","v":"-- Ethers with 5 or more carbon atoms per molecule"},{"$f":"'Methods&Limits'!B62","v":"% V/V"},{"$f":"'Methods&Limits'!E62","v":"EN-ISO 22854"},{"$f":"'Methods&Limits'!F62","v":2021},{"$f":"'Methods&Limits'!G62","v":0.9},null,{"$f":"'Methods&Limits'!I62","v":22.530999999999999},""]
[{"$f":"'Methods&Limits'!A63","v":"-- other oxygenates"},{"$f":"'Methods&Limits'!B63","v":"% V/V"},{"$f":"'Methods&Limits'!E63","v":"EN-ISO 22854"},{"$f":"'Methods&Limits'!F63","v":2021},{"$f":"'Methods&Limits'!G63","v":0.7},null,{"$f":"'Methods&Limits'!I63","v":15.413},""]
[{"$f":"'Methods&Limits'!A64:A64","v":"Sulphur content (sulphur free, from 2005)**"},{"$f":"'Methods&Limits'!B64","v":"mg/kg"},{"$f":"'Methods&Limits'!E64","v":"EN-ISO 14596"},{"$f":"'Methods&Limits'!F64","v":2018},{"$f":"'Methods&Limits'!G64","v":5},null,{"$f":"'Methods&Limits'!I64","v":12.95},{"$f":"IF(E$38=\"\",\"\",IF(E$38>G117,\"Yes\",\"\"))","v":""}]
[null,null,{"$f":"'Methods&Limits'!E65","v":"EN 24260"},{"$f":"'Methods&Limits'!F65","v":1994},{"$f":"'Methods&Limits'!G65","v":1},null,{"$f":"'Methods&Limits'!I65","v":10.59},{"$f":"IF(E$38=\"\",\"\",IF(E$38>G118,\"Yes\",\"\"))","v":""}]
[null,null,{"$f":"'Methods&Limits'!E66","v":"EN-ISO 20846"},{"$f":"'Methods&Limits'!F66","v":2019},{"$f":"'Methods&Limits'!G66","v":2.7},null,{"$f":"'Methods&Limits'!I66","v":11.593},{"$f":"IF(E$38=\"\",\"\",IF(E$38>G119,\"Yes\",\"\"))","v":""}]
[null,null,{"$f":"'Methods&Limits'!E67","v":"EN-ISO 20884"},{"$f":"'Methods&Limits'!F67","v":2019},{"$f":"'Methods&Limits'!G67","v":3.1},null,{"$f":"'Methods&Limits'!I67","v":11.829000000000001},{"$f":"IF(E$38=\"\",\"\",IF(E$38>G120,\"Yes\",\"\"))","v":""}]
[{"$f":"'Methods&Limits'!A68:A68","v":"Lead content"},{"$f":"'Methods&Limits'!B68","v":"g/l"},{"$f":"'Methods&Limits'!E68","v":"EN 237"},{"$f":"'Methods&Limits'!F68","v":2004},{"$f":"'Methods&Limits'!G68","v":6.1999999999999998E-3},null,{"$f":"'Methods&Limits'!I68","v":8.657999999999999E-3},{"$f":"IF(E39=\"\",\"\",IF(E39>G121,\"Yes\",\"\"))","v":""}]

{"sheet":"Diesel (1)","index":28,"n_rows":49,"n_cols":18,"rows_kept":49,"cut":false,"hidden":false,"merged":[[50,11,50,12],[49,0,50,0],[49,1,50,1],[7,1,7,3],[23,0,23,3],[24,4,25,13],[26,4,26,13],[27,4,28,13],[38,9,38,12],[45,11,45,12],[49,11,49,12],[48,11,48,12],[44,11,44,12],[41,11,41,12],[33,0,33,13],[38,2,38,8],[39,10,40,10],[39,11,40,12],[10,15,10,16],[11,15,11,16],[30,4,30,13],[10,2,11,10],[10,11,10,14],[43,11,43,12],[6,1,6,3],[29,4,29,13],[46,11,46,12],[47,11,47,12],[2,6,9,16],[11,13,11,14],[2,1,2,3],[3,1,3,3],[4,1,4,3],[5,1,5,3],[11,11,11,12],[42,11,42,12],[39,5,39,6],[39,8,40,8],[39,9,40,9]]}
["Market Fuels used in the Compression Ignition Engines (Diesel)",null,null,null,null,null,null,null,null,null,null,null,null,null,null,null,null,"<-- GO BACK"]
[]
["Country",{"$f":"IF(LEN('Contacts&Annual Summary'!C9) > 1,'Contacts&Annual Summary'!C9,\"\")","v":""},null,null,null,null,"Notes on completing the tables\nThe table structure has been locked to prevent modification - data can be copied and pasted, in bulk into the Reporting Results blue table cells.  Where a white row exists between rows, it will not be possible to paste over white rows and sections should be pasted separately.\n\nColumn H in the Test Methods and Analysis table is set to automatically check whether the numerical values entered in the Reporting Results table exceed maximum or minimum Tolerance Limits.  If any exceedance is detected, please provide details in the columns to the right including the number of samples, location samples were taken from, Values and Details of any action taken to address non-compliant samples.  Compliance information is verified manually and this automated compliance check is not solely relied upon during data analysis.\n\nPlease do not unlock this template - modified templates cannot be processed and may delay reporting."]
["Reporting year",{"$f":"'Contacts&Annual Summary'!C8","v":2023}]
["Period (Summer or Winter)","Summer"]
["Parent fuel grade","Diesel"]
["National fuel grade"]
["The maximum FAME content (% v/v)",0]
["Reporting Results"]
[]
["Parameter","Unit","Analytical and statistical results",null,null,null,null,null,null,null,null,"Limiting value (1)",null,null,null,"Test method"]
[null,null,null,null,null,null,null,null,null,null,null,"National Specifications",null,"According to Directive 2009/30/EC",null,"(more recent versions may also be used)"]
[null,null,"No Samples","Minimum","Maximum","Median","Mean","Standard deviation","No Samples outside 95% tolerance limit","25% of Sample Value","75% of Sample Value","Minimum","Maximum","Minimum","Maximum","Method","Date"]
["Cetane number","--",0,0,0,0,0,0,0,0,0,null,null,51,"--","EN-ISO 5165",1998]
["Density at 15 oC (2)","kg/m3",0,0,0,0,0,0,0,0,0,null,null,null,845,"EN-ISO 3675",1998]
["Distillation -- 95-%-Point","oC",0,0,0,0,0,0,0,0,0,null,null,null,360,"EN-ISO 3405",2000]
["Polycyclic aromatic hydrocarbons (PAH) (3)","% (m/m)",0,0,0,0,0,0,0,0,0,null,null,null,8,"EN 12916",2006]
["Sulphur content","mg/kg",0,0,0,0,0,0,0,0,0,null,null,null,10,"EN ISO 20846\nEN ISO 20884",2004]
["FAME Content","% v/v",0,0,0,0,0,0,0,0,0,null,null,null,"7 (4)","EN 14078",2009]
[]
[]
["Sampling Frequency"]
[]
["Number of samples in month"]
["January",0,"July",0,"(1) The limiting values are \"true values\" and were established according to the procedures for limit setting in EN 228:2008.  The results of individual measurements shall be interpreted following the criteria described in EN 228:2008."]
["February",0,"August",0]
["March",0,"September",0,"(2) In cases of dispute EN ISO 3675: 1998 shall be used"]
["April",0,"October",0,"(3) Polycyclic aromatic hydrocarbons are defined as the total aromatic hydrocarbon content less than the mono-aromatic hydrocarbons content, both as determined by EN 12916"]
["May",0,"November",0]
["June",0,"December",0,"(4) FAME shall comply with EN 14078"]
[null,null,"Summer Months Total",{"$f":"SUM(B25:B30,D25:D30)","v":0},"(5) Only for countries which are measuring MMT in Diesel"]
[]
["Other notes (optional):"]
[]
[]
[]
["Test Methods and Analysis"]
[]
["Parameter","Unit","Test specified in 98/70/EC or EN590: 590 (more recent versions may also be used)",null,null,null,null,null,null,"Notes on exceedences"]
[null,null,"Method","Date","Reproducability, R","Tolerance limits",null,null,null,"Sample location \n(S,T or R)","Values","Details/action taken"]
[null,null,null,null,null,"Minimum","Maximum","Exceeded?"]
[{"$f":"'Methods&Limits'!A81","v":"Cetane number"},{"$f":"'Methods&Limits'!B81","v":"--"},{"$f":"'Methods&Limits'!E81","v":"EN-ISO 5165"},{"$f":"'Methods&Limits'!F81","v":2020},{"$f":"'Methods&Limits'!G81","v":4.3},{"$f":"'Methods&Limits'!H81","v":48.463000000000001},null,{"$f":"IF(D14=\"\",\"\",IF(D14<F42,\"Yes\",\"\"))","v":"Yes"}]
[{"$f":"'Methods&Limits'!A82","v":"Density at 15 oC"},{"$f":"'Methods&Limits'!B82","v":"kg/m3"},{"$f":"'Methods&Limits'!E82","v":"EN-ISO 3675"},{"$f":"'Methods&Limits'!F82","v":2022},{"$f":"'Methods&Limits'!G82","v":1.2},{"$f":"'Methods&Limits'!H82","v":0},{"$f":"'Methods&Limits'!I82","v":845.70799999999997},{"$f":"IF(E15=\"\",\"\",IF(E15>G43,\"Yes\",\"\"))","v":""}]
[null,null,{"$f":"'Methods&Limits'!E83","v":"EN-ISO 12185"},{"$f":"'Methods&Limits'!F83","v":2024},{"$f":"'Methods&Limits'!G83","v":0.50847457627110937},{"$f":"'Methods&Limits'!H83","v":0},{"$f":"'Methods&Limits'!I83","v":845.3},{"$f":"IF(E15=\"\",\"\",IF(E15>G44,\"Yes\",\"\"))","v":""}]
[{"$f":"'Methods&Limits'!A84","v":"Distillation -- 95% Point"},{"$f":"'Methods&Limits'!B84","v":"oC"},{"$f":"'Methods&Limits'!E84","v":"EN-ISO 3405"},{"$f":"'Methods&Limits'!F84","v":2019},{"$f":"'Methods&Limits'!G84","v":10},{"$f":"'Methods&Limits'!H84","v":0},{"$f":"'Methods&Limits'!I84","v":365.9},{"$f":"IF(E16=\"\",\"\",IF(E16>G45,\"Yes\",\"\"))","v":""}]
[{"$f":"'Methods&Limits'!A85","v":"Polycyclic aromatic hydrocarbons"},{"$f":"'Methods&Limits'!B85","v":"% (m/m)"},{"$f":"'Methods&Limits'!E85","v":"EN 12916"},{"$f":"'Methods&Limits'!F85","v":2019},{"$f":"'Methods&Limits'!G85","v":1.9},{"$f":"'Methods&Limits'!H85","v":0},{"$f":"'Methods&Limits'!I85","v":9.1210000000000004},{"$f":"IF(E17=\"\",\"\",IF(E17>G46,\"Yes\",\"\"))","v":""}]
[{"$f":"'Methods&Limits'!A86","v":"Sulphur content (sulphur free, from 2005)"},{"$f":"'Methods&Limits'!B86","v":"mg/kg"},{"$f":"'Methods&Limits'!E86","v":"EN-ISO 20846"},{"$f":"'Methods&Limits'!F86","v":2019},{"$f":"'Methods&Limits'!G86","v":2.2000000000000002},{"$f":"'Methods&Limits'!H86","v":0},{"$f":"'Methods&Limits'!I86","v":11.298},{"$f":"IF(E18=\"\",\"\",IF(E18>G47,\"Yes\",\"\"))","v":""}]
[null,null,{"$f":"'Methods&Limits'!E87","v":"EN-ISO 20884"},{"$f":"'Methods&Limits'!F87","v":2019},{"$f":"'Methods&Limits'!G87","v":3.1},{"$f":"'Methods&Limits'!H87","v":0},{"$f":"'Methods&Limits'!I87","v":11.829000000000001},{"$f":"IF(E18=\"\",\"\",IF(E18>G48,\"Yes\",\"\"))","v":""}]
[{"$f":"'Methods&Limits'!A88","v":"FAME Content"},{"$f":"'Methods&Limits'!B88","v":"% V/V"},{"$f":"'Methods&Limits'!E88","v":"EN14078"},{"$f":"'Methods&Limits'!F88","v":2014},{"$f":"'Methods&Limits'!G88","v":0.5},{"$f":"'Methods&Limits'!H88","v":0},{"$f":"'Methods&Limits'!I88","v":10.295},{"$f":"IF(E19=\"\",\"\",IF(E19>G49,\"Yes\",\"\"))","v":""}]

{"sheet":"Diesel (2)","index":29,"n_rows":49,"n_cols":18,"rows_kept":49,"cut":false,"hidden":false,"merged":[[50,11,50,12],[49,0,50,0],[49,1,50,1],[3,1,3,3],[4,1,4,3],[5,1,5,3],[6,1,6,3],[24,4,25,13],[7,1,7,3],[29,4,29,13],[38,2,38,8],[2,6,9,16],[38,9,38,12],[39,5,39,6],[39,8,40,8],[26,4,26,13],[33,0,33,13],[2,1,2,3],[39,9,40,9],[39,10,40,10],[42,11,42,12],[39,11,40,12],[41,11,41,12],[49,11,49,12],[48,11,48,12],[10,15,10,16],[11,11,11,12],[11,13,11,14],[11,15,11,16],[30,4,30,13],[10,2,11,10],[10,11,10,14],[23,0,23,3],[27,4,28,13],[43,11,43,12],[44,11,44,12],[45,11,45,12],[46,11,46,12],[47,11,47,12]]}
["Market Fuels used in the Compression Ignition Engines (Diesel)",null,null,null,null,null,null,null,null,null,null,null,null,null,null,null,null,"<-- GO BACK"]
[]
["Country",{"$f":"IF(LEN('Contacts&Annual Summary'!C9) > 1,'Contacts&Annual Summary'!C9,\"\")","v":""},null,null,null,null,"Notes on completing the tables\nThe table structure has been locked to prevent modification - data can be copied and pasted, in bulk into the Reporting Results blue table cells.  Where a white row exists between rows, it will not be possible to paste over white rows and sections should be pasted separately.\n\nColumn H in the Test Methods and Analysis table is set to automatically check whether the numerical values entered in the Reporting Results table exceed maximum or minimum Tolerance Limits.  If any exceedance is detected, please provide details in the columns to the right including the number of samples, location samples were taken from, Values and Details of any action taken to address non-compliant samples.  Compliance information is verified manually and this automated compliance check is not solely relied upon during data analysis.\n\nPlease do not unlock this template - modified templates cannot be processed and may delay reporting."]
["Reporting year",{"$f":"'Contacts&Annual Summary'!C8","v":2023}]
["Period (Summer or Winter)","Winter"]
["Parent fuel grade","Diesel"]
["National fuel grade",{"$f":"'Diesel (1)'!B7","v":0}]
["The maximum FAME content (% v/v)",0]
["Reporting Results"]
[]
["Parameter","Unit","Analytical and statistical results",null,null,null,null,null,null,null,null,"Limiting value (1)",null,null,null,"Test method"]
[null,null,null,null,null,null,null,null,null,null,null,"National Specifications",null,"According to Directive 2009/30/EC",null,"(more recent versions may also be used)"]
[null,null,"No Samples","Minimum","Maximum","Median","Mean","Standard deviation","No Samples outside 95% tolerance limit","25% of Sample Value","75% of Sample Value","Minimum","Maximum","Minimum","Maximum","Method","Date"]
["Cetane number","--",0,0,0,0,0,0,0,0,0,null,null,51,"--","EN-ISO 5165",1998]
["Density at 15 oC (2)","kg/m3",0,0,0,0,0,0,0,0,0,null,null,null,845,"EN-ISO 3675",1998]
["Distillation -- 95-%-Point","oC",0,0,0,0,0,0,0,0,0,null,null,null,360,"EN-ISO 3405",2000]
["Polycyclic aromatic hydrocarbons (PAH) (3)","% (m/m)",0,0,0,0,0,0,0,0,0,null,null,null,8,"EN 12916",2006]
["Sulphur content","mg/kg",0,0,0,0,0,0,0,0,0,null,null,null,10,"EN ISO 20846\nEN ISO 20884",2004]
["FAME Content","% v/v",0,0,0,0,0,0,0,0,0,null,null,null,"7 (4)","EN 14078",2009]
[]
[]
["Sampling Frequency"]
[]
["Number of samples in month"]
["January",0,"July",0,"(1) The limiting values are \"true values\" and were established according to the procedures for limit setting in EN 228:2008.  The results of individual measurements shall be interpreted following the criteria described in EN 228:2008."]
["February",0,"August",0]
["March",0,"September",0,"(2) In cases of dispute EN ISO 3675: 1998 shall be used"]
["April",0,"October",0,"(3) Polycyclic aromatic hydrocarbons are defined as the total aromatic hydrocarbon content less than the mono-aromatic hydrocarbons content, both as determined by EN 12916"]
["May",0,"November",0]
["June",0,"December",0,"(4) FAME shall comply with EN 14078"]
[null,null,"Winter Months Total",{"$f":"SUM(B25:B30,D25:D30)","v":0},"(5) Only for countries which are measuring MMT in Diesel"]
[]
["Other notes (optional):"]
[]
[]
[]
["Test Methods and Analysis"]
[]
["Parameter","Unit","Test specified in 98/70/EC or EN590: 590 (more recent versions may also be used)",null,null,null,null,null,null,"Notes on exceedences"]
[null,null,"Method","Date","Reproducability, R","Tolerance limits",null,null,null,"Sample location \n(S,T or R)","Values","Details/action taken"]
[null,null,null,null,null,"Minimum","Maximum","Exceeded?"]
[{"$f":"'Methods&Limits'!A81","v":"Cetane number"},{"$f":"'Methods&Limits'!B81","v":"--"},{"$f":"'Methods&Limits'!E81","v":"EN-ISO 5165"},{"$f":"'Methods&Limits'!F81","v":2020},{"$f":"'Methods&Limits'!G81","v":4.3},{"$f":"'Methods&Limits'!H81","v":48.463000000000001},null,{"$f":"IF(D14=\"\",\"\",IF(D14<F42,\"Yes\",\"\"))","v":"Yes"}]
[{"$f":"'Methods&Limits'!A82","v":"Density at 15 oC"},{"$f":"'Methods&Limits'!B82","v":"kg/m3"},{"$f":"'Methods&Limits'!E82","v":"EN-ISO 3675"},{"$f":"'Methods&Limits'!F82","v":2022},{"$f":"'Methods&Limits'!G82","v":1.2},{"$f":"'Methods&Limits'!H82","v":0},{"$f":"'Methods&Limits'!I82","v":845.70799999999997},{"$f":"IF(E15=\"\",\"\",IF(E15>G43,\"Yes\",\"\"))","v":""}]
[null,null,{"$f":"'Methods&Limits'!E83","v":"EN-ISO 12185"},{"$f":"'Methods&Limits'!F83","v":2024},{"$f":"'Methods&Limits'!G83","v":0.50847457627110937},{"$f":"'Methods&Limits'!H83","v":0},{"$f":"'Methods&Limits'!I83","v":845.3},{"$f":"IF(E15=\"\",\"\",IF(E15>G44,\"Yes\",\"\"))","v":""}]
[{"$f":"'Methods&Limits'!A84","v":"Distillation -- 95% Point"},{"$f":"'Methods&Limits'!B84","v":"oC"},{"$f":"'Methods&Limits'!E84","v":"EN-ISO 3405"},{"$f":"'Methods&Limits'!F84","v":2019},{"$f":"'Methods&Limits'!G84","v":10},{"$f":"'Methods&Limits'!H84","v":0},{"$f":"'Methods&Limits'!I84","v":365.9},{"$f":"IF(E16=\"\",\"\",IF(E16>G45,\"Yes\",\"\"))","v":""}]
[{"$f":"'Methods&Limits'!A85","v":"Polycyclic aromatic hydrocarbons"},{"$f":"'Methods&Limits'!B85","v":"% (m/m)"},{"$f":"'Methods&Limits'!E85","v":"EN 12916"},{"$f":"'Methods&Limits'!F85","v":2019},{"$f":"'Methods&Limits'!G85","v":1.9},{"$f":"'Methods&Limits'!H85","v":0},{"$f":"'Methods&Limits'!I85","v":9.1210000000000004},{"$f":"IF(E17=\"\",\"\",IF(E17>G46,\"Yes\",\"\"))","v":""}]
[{"$f":"'Methods&Limits'!A86","v":"Sulphur content (sulphur free, from 2005)"},{"$f":"'Methods&Limits'!B86","v":"mg/kg"},{"$f":"'Methods&Limits'!E86","v":"EN-ISO 20846"},{"$f":"'Methods&Limits'!F86","v":2019},{"$f":"'Methods&Limits'!G86","v":2.2000000000000002},{"$f":"'Methods&Limits'!H86","v":0},{"$f":"'Methods&Limits'!I86","v":11.298},{"$f":"IF(E18=\"\",\"\",IF(E18>G47,\"Yes\",\"\"))","v":""}]
[null,null,{"$f":"'Methods&Limits'!E87","v":"EN-ISO 20884"},{"$f":"'Methods&Limits'!F87","v":2019},{"$f":"'Methods&Limits'!G87","v":3.1},{"$f":"'Methods&Limits'!H87","v":0},{"$f":"'Methods&Limits'!I87","v":11.829000000000001},{"$f":"IF(E18=\"\",\"\",IF(E18>G48,\"Yes\",\"\"))","v":""}]
[{"$f":"'Methods&Limits'!A88","v":"FAME Content"},{"$f":"'Methods&Limits'!B88","v":"% V/V"},{"$f":"'Methods&Limits'!E88","v":"EN14078"},{"$f":"'Methods&Limits'!F88","v":2014},{"$f":"'Methods&Limits'!G88","v":0.5},{"$f":"'Methods&Limits'!H88","v":0},{"$f":"'Methods&Limits'!I88","v":10.295},{"$f":"IF(E19=\"\",\"\",IF(E19>G49,\"Yes\",\"\"))","v":""}]

{"sheet":"Diesel (1+2)","index":30,"n_rows":49,"n_cols":18,"rows_kept":49,"cut":false,"hidden":false,"merged":[[11,15,11,16],[5,1,5,3],[10,2,11,10],[7,1,7,3],[6,1,6,3],[2,6,9,16],[10,11,10,14],[10,15,10,16],[50,11,50,12],[49,0,50,0],[49,1,50,1],[26,4,26,13],[27,4,28,13],[29,4,29,13],[42,11,42,12],[44,11,44,12],[33,0,33,13],[38,2,38,8],[38,9,38,12],[41,11,41,12],[43,11,43,12],[46,11,46,12],[30,4,30,13],[47,11,47,12],[23,0,23,3],[24,4,25,13],[2,1,2,3],[3,1,3,3],[4,1,4,3],[11,11,11,12],[11,13,11,14],[49,11,49,12],[48,11,48,12],[45,11,45,12],[39,5,39,6],[39,8,40,8],[39,9,40,9],[39,10,40,10],[39,11,40,12]]}
["Market Fuels used in the Compression Ignition Engines (Diesel)",null,null,null,null,null,null,null,null,null,null,null,null,null,null,null,null,"<-- GO BACK"]
[]
["Country",{"$f":"IF(LEN('Contacts&Annual Summary'!C9) > 1,'Contacts&Annual Summary'!C9,\"\")","v":""},null,null,null,null,"Notes on completing the tables\nThe table structure has been locked to prevent modification - data can be copied and pasted, in bulk into the Reporting Results blue table cells.  Where a white row exists between rows, it will not be possible to paste over white rows and sections should be pasted separately.\n\nColumn H in the Test Methods and Analysis table is set to automatically check whether the numerical values entered in the Reporting Results table exceed maximum or minimum Tolerance Limits.  If any exceedance is detected, please provide details in the columns to the right including the number of samples, location samples were taken from, Values and Details of any action taken to address non-compliant samples.  Compliance information is verified manually and this automated compliance check is not solely relied upon during data analysis.\n\nPlease do not unlock this template - modified templates cannot be processed and may delay reporting."]
["Reporting year",{"$f":"'Contacts&Annual Summary'!C8","v":2023}]
["Period (Summer or Winter)","Full Year"]
["Parent fuel grade","Diesel"]
["National fuel grade",{"$f":"'Diesel (1)'!B7","v":0}]
["The maximum FAME content (% v/v)",{"$f":"MAX('Diesel (1)'!B8:D8,'Diesel (2)'!B8:D8)","v":0}]
["Reporting Results"]
[]
["Parameter","Unit","Analytical and statistical results",null,null,null,null,null,null,null,null,"Limiting value (1)",null,null,null,"Test method"]
[null,null,null,null,null,null,null,null,null,null,null,"National Specifications",null,"According to Directive 2009/30/EC",null,"(more recent versions may also be used)"]
[null,null,"No Samples","Minimum","Maximum","Median","Mean","Standard deviation","No Samples outside 95% tolerance limit","25% of Sample Value","75% of Sample Value","Minimum","Maximum","Minimum","Maximum","Method","Date"]
["Cetane number","--",{"$f":"IF(AND('Diesel (1)'!C14=\"\",'Diesel (2)'!C14=\"\"),\"\",SUM('Diesel (1)'!C14,'Diesel (2)'!C14))","v":0},{"$f":"IF(AND('Diesel (1)'!D14=\"\",'Diesel (2)'!D14=\"\"),\"\",MIN('Diesel (1)'!D14,'Diesel (2)'!D14))","v":0},{"$f":"IF(AND('Diesel (1)'!E14=\"\",'Diesel (2)'!E14=\"\"),\"\",MAX('Diesel (1)'!E14,'Diesel (2)'!E14))","v":0},0,0,0,{"$f":"IF(AND('Diesel (1)'!I14=\"\",'Diesel (2)'!I14=\"\"),\"\",SUM('Diesel (1)'!I14,'Diesel (2)'!I14))","v":0},0,0,null,null,51,"--","EN-ISO 5165",1998]
["Density at 15 oC (2)","kg/m3",{"$f":"IF(AND('Diesel (1)'!C15=\"\",'Diesel (2)'!C15=\"\"),\"\",SUM('Diesel (1)'!C15,'Diesel (2)'!C15))","v":0},{"$f":"IF(AND('Diesel (1)'!D15=\"\",'Diesel (2)'!D15=\"\"),\"\",MIN('Diesel (1)'!D15,'Diesel (2)'!D15))","v":0},{"$f":"IF(AND('Diesel (1)'!E15=\"\",'Diesel (2)'!E15=\"\"),\"\",MAX('Diesel (1)'!E15,'Diesel (2)'!E15))","v":0},0,0,0,{"$f":"IF(AND('Diesel (1)'!I15=\"\",'Diesel (2)'!I15=\"\"),\"\",SUM('Diesel (1)'!I15,'Diesel (2)'!I15))","v":0},0,0,null,null,null,845,"EN-ISO 3675",1998]
["Distillation -- 95-%-Point","oC",{"$f":"IF(AND('Diesel (1)'!C16=\"\",'Diesel (2)'!C16=\"\"),\"\",SUM('Diesel (1)'!C16,'Diesel (2)'!C16))","v":0},{"$f":"IF(AND('Diesel (1)'!D16=\"\",'Diesel (2)'!D16=\"\"),\"\",MIN('Diesel (1)'!D16,'Diesel (2)'!D16))","v":0},{"$f":"IF(AND('Diesel (1)'!E16=\"\",'Diesel (2)'!E16=\"\"),\"\",MAX('Diesel (1)'!E16,'Diesel (2)'!E16))","v":0},0,0,0,{"$f":"IF(AND('Diesel (1)'!I16=\"\",'Diesel (2)'!I16=\"\"),\"\",SUM('Diesel (1)'!I16,'Diesel (2)'!I16))","v":0},0,0,null,null,null,360,"EN-ISO 3405",2000]
["Polycyclic aromatic hydrocarbons (PAH) (3)","% (m/m)",{"$f":"IF(AND('Diesel (1)'!C17=\"\",'Diesel (2)'!C17=\"\"),\"\",SUM('Diesel (1)'!C17,'Diesel (2)'!C17))","v":0},{"$f":"IF(AND('Diesel (1)'!D17=\"\",'Diesel (2)'!D17=\"\"),\"\",MIN('Diesel (1)'!D17,'Diesel (2)'!D17))","v":0},{"$f":"IF(AND('Diesel (1)'!E17=\"\",'Diesel (2)'!E17=\"\"),\"\",MAX('Diesel (1)'!E17,'Diesel (2)'!E17))","v":0},0,0,0,{"$f":"IF(AND('Diesel (1)'!I17=\"\",'Diesel (2)'!I17=\"\"),\"\",SUM('Diesel (1)'!I17,'Diesel (2)'!I17))","v":0},0,0,null,null,null,8,"EN 12916",2006]
["Sulphur content","mg/kg",{"$f":"IF(AND('Diesel (1)'!C18=\"\",'Diesel (2)'!C18=\"\"),\"\",SUM('Diesel (1)'!C18,'Diesel (2)'!C18))","v":0},{"$f":"IF(AND('Diesel (1)'!D18=\"\",'Diesel (2)'!D18=\"\"),\"\",MIN('Diesel (1)'!D18,'Diesel (2)'!D18))","v":0},{"$f":"IF(AND('Diesel (1)'!E18=\"\",'Diesel (2)'!E18=\"\"),\"\",MAX('Diesel (1)'!E18,'Diesel (2)'!E18))","v":0},0,0,0,{"$f":"IF(AND('Diesel (1)'!I18=\"\",'Diesel (2)'!I18=\"\"),\"\",SUM('Diesel (1)'!I18,'Diesel (2)'!I18))","v":0},0,0,null,null,null,10,"EN ISO 20846\nEN ISO 20884",2004]
["FAME Content","% v/v",{"$f":"IF(AND('Diesel (1)'!C19=\"\",'Diesel (2)'!C19=\"\"),\"\",SUM('Diesel (1)'!C19,'Diesel (2)'!C19))","v":0},{"$f":"IF(AND('Diesel (1)'!D19=\"\",'Diesel (2)'!D19=\"\"),\"\",MIN('Diesel (1)'!D19,'Diesel (2)'!D19))","v":0},{"$f":"IF(AND('Diesel (1)'!E19=\"\",'Diesel (2)'!E19=\"\"),\"\",MAX('Diesel (1)'!E19,'Diesel (2)'!E19))","v":0},0,0,0,{"$f":"IF(AND('Diesel (1)'!I19=\"\",'Diesel (2)'!I19=\"\"),\"\",SUM('Diesel (1)'!I19,'Diesel (2)'!I19))","v":0},0,0,null,null,null,"7 (4)","EN 14078",2009]
[]
[]
["Sampling Frequency"]
[]
["Number of samples in month"]
["January",{"$f":"'Diesel (1)'!B25+'Diesel (2)'!B25","v":0},"July",{"$f":"'Diesel (1)'!D25+'Diesel (2)'!D25","v":0},"(1) The limiting values are \"true values\" and were established according to the procedures for limit setting in EN 228:2008.  The results of individual measurements shall be interpreted following the criteria described in EN 228:2008."]
["February",{"$f":"'Diesel (1)'!B26+'Diesel (2)'!B26","v":0},"August",{"$f":"'Diesel (1)'!D26+'Diesel (2)'!D26","v":0}]
["March",{"$f":"'Diesel (1)'!B27+'Diesel (2)'!B27","v":0},"September",{"$f":"'Diesel (1)'!D27+'Diesel (2)'!D27","v":0},"(2) In cases of dispute EN ISO 3675: 1998 shall be used"]
["April",{"$f":"'Diesel (1)'!B28+'Diesel (2)'!B28","v":0},"October",{"$f":"'Diesel (1)'!D28+'Diesel (2)'!D28","v":0},"(3) Polycyclic aromatic hydrocarbons are defined as the total aromatic hydrocarbon content less than the mono-aromatic hydrocarbons content, both as determined by EN 12916"]
["May",{"$f":"'Diesel (1)'!B29+'Diesel (2)'!B29","v":0},"November",{"$f":"'Diesel (1)'!D29+'Diesel (2)'!D29","v":0}]
["June",{"$f":"'Diesel (1)'!B30+'Diesel (2)'!B30","v":0},"December",{"$f":"'Diesel (1)'!D30+'Diesel (2)'!D30","v":0},"(4) FAME shall comply with EN 14078"]
[null,null,"Full Year Total",{"$f":"SUM(B25:B30,D25:D30)","v":0},"(5) Only for countries which are measuring MMT in Diesel"]
[]
["Other notes (optional):"]
[]
[]
[]
["Test Methods and Analysis",null,null,null,null,null,null,null,null,"Only if not provided in Summer and Winter sheets"]
[]
["Parameter","Unit","Test specified in 98/70/EC or EN590: 590 (more recent versions may also be used)",null,null,null,null,null,null,"Notes on exceedences"]
[null,null,"Method","Date","Reproducability, R","Tolerance limits",null,null,null,"Sample location \n(S,T or R)","Values","Details/action taken"]
[null,null,null,null,null,"Minimum","Maximum","Exceeded?"]
[{"$f":"'Methods&Limits'!A81","v":"Cetane number"},{"$f":"'Methods&Limits'!B81","v":"--"},{"$f":"'Methods&Limits'!E81","v":"EN-ISO 5165"},{"$f":"'Methods&Limits'!F81","v":2020},{"$f":"'Methods&Limits'!G81","v":4.3},{"$f":"'Methods&Limits'!H81","v":48.463000000000001},null,{"$f":"IF(D14=\"\",\"\",IF(D14<F42,\"Yes\",\"\"))","v":"Yes"}]
[{"$f":"'Methods&Limits'!A82","v":"Density at 15 oC"},{"$f":"'Methods&Limits'!B82","v":"kg/m3"},{"$f":"'Methods&Limits'!E82","v":"EN-ISO 3675"},{"$f":"'Methods&Limits'!F82","v":2022},{"$f":"'Methods&Limits'!G82","v":1.2},{"$f":"'Methods&Limits'!H82","v":0},{"$f":"'Methods&Limits'!I82","v":845.70799999999997},{"$f":"IF(E15=\"\",\"\",IF(E15>G43,\"Yes\",\"\"))","v":""}]
[null,null,{"$f":"'Methods&Limits'!E83","v":"EN-ISO 12185"},{"$f":"'Methods&Limits'!F83","v":2024},{"$f":"'Methods&Limits'!G83","v":0.50847457627110937},{"$f":"'Methods&Limits'!H83","v":0},{"$f":"'Methods&Limits'!I83","v":845.3},{"$f":"IF(E15=\"\",\"\",IF(E15>G44,\"Yes\",\"\"))","v":""}]
[{"$f":"'Methods&Limits'!A84","v":"Distillation -- 95% Point"},{"$f":"'Methods&Limits'!B84","v":"oC"},{"$f":"'Methods&Limits'!E84","v":"EN-ISO 3405"},{"$f":"'Methods&Limits'!F84","v":2019},{"$f":"'Methods&Limits'!G84","v":10},{"$f":"'Methods&Limits'!H84","v":0},{"$f":"'Methods&Limits'!I84","v":365.9},{"$f":"IF(E16=\"\",\"\",IF(E16>G45,\"Yes\",\"\"))","v":""}]
[{"$f":"'Methods&Limits'!A85","v":"Polycyclic aromatic hydrocarbons"},{"$f":"'Methods&Limits'!B85","v":"% (m/m)"},{"$f":"'Methods&Limits'!E85","v":"EN 12916"},{"$f":"'Methods&Limits'!F85","v":2019},{"$f":"'Methods&Limits'!G85","v":1.9},{"$f":"'Methods&Limits'!H85","v":0},{"$f":"'Methods&Limits'!I85","v":9.1210000000000004},{"$f":"IF(E17=\"\",\"\",IF(E17>G46,\"Yes\",\"\"))","v":""}]
[{"$f":"'Methods&Limits'!A86","v":"Sulphur content (sulphur free, from 2005)"},{"$f":"'Methods&Limits'!B86","v":"mg/kg"},{"$f":"'Methods&Limits'!E86","v":"EN-ISO 20846"},{"$f":"'Methods&Limits'!F86","v":2019},{"$f":"'Methods&Limits'!G86","v":2.2000000000000002},{"$f":"'Methods&Limits'!H86","v":0},{"$f":"'Methods&Limits'!I86","v":11.298},{"$f":"IF(E18=\"\",\"\",IF(E18>G47,\"Yes\",\"\"))","v":""}]
[null,null,{"$f":"'Methods&Limits'!E87","v":"EN-ISO 20884"},{"$f":"'Methods&Limits'!F87","v":2019},{"$f":"'Methods&Limits'!G87","v":3.1},{"$f":"'Methods&Limits'!H87","v":0},{"$f":"'Methods&Limits'!I87","v":11.829000000000001},{"$f":"IF(E18=\"\",\"\",IF(E18>G48,\"Yes\",\"\"))","v":""}]
[{"$f":"'Methods&Limits'!A88","v":"FAME Content"},{"$f":"'Methods&Limits'!B88","v":"% V/V"},{"$f":"'Methods&Limits'!E88","v":"EN14078"},{"$f":"'Methods&Limits'!F88","v":2014},{"$f":"'Methods&Limits'!G88","v":0.5},{"$f":"'Methods&Limits'!H88","v":0},{"$f":"'Methods&Limits'!I88","v":10.295},{"$f":"IF(E19=\"\",\"\",IF(E19>G49,\"Yes\",\"\"))","v":""}]

{"sheet":"Diesel (3)","index":31,"n_rows":49,"n_cols":18,"rows_kept":49,"cut":false,"hidden":false,"merged":[[2,1,2,3],[2,6,9,16],[3,1,3,3],[4,1,4,3],[5,1,5,3],[6,1,6,3],[7,1,7,3],[30,4,30,13],[10,2,11,10],[10,11,10,14],[10,15,10,16],[11,11,11,12],[11,13,11,14],[11,15,11,16],[23,0,23,3],[24,4,25,13],[26,4,26,13],[27,4,28,13],[29,4,29,13],[46,11,46,12],[33,0,33,13],[38,2,38,8],[38,9,38,12],[39,5,39,6],[39,8,40,8],[39,9,40,9],[39,10,40,10],[39,11,40,12],[41,11,41,12],[42,11,42,12],[43,11,43,12],[44,11,44,12],[45,11,45,12],[47,11,47,12],[48,11,48,12],[49,0,50,0],[49,1,50,1],[50,11,50,12],[49,11,49,12]]}
["Market Fuels used in the Compression Ignition Engines (Diesel)",null,null,null,null,null,null,null,null,null,null,null,null,null,null,null,null,"<-- GO BACK"]
[]
["Country",{"$f":"IF(LEN('Contacts&Annual Summary'!C9) > 1,'Contacts&Annual Summary'!C9,\"\")","v":""},null,null,null,null,"Notes on completing the tables\nThe table structure has been locked to prevent modification - data can be copied and pasted, in bulk into the Reporting Results blue table cells.  Where a white row exists between rows, it will not be possible to paste over white rows and sections should be pasted separately.\n\nColumn H in the Test Methods and Analysis table is set to automatically check whether the numerical values entered in the Reporting Results table exceed maximum or minimum Tolerance Limits.  If any exceedance is detected, please provide details in the columns to the right including the number of samples, location samples were taken from, Values and Details of any action taken to address non-compliant samples.  Compliance information is verified manually and this automated compliance check is not solely relied upon during data analysis.\n\nPlease do not unlock this template - modified templates cannot be processed and may delay reporting."]
["Reporting year",{"$f":"'Contacts&Annual Summary'!C8","v":2023}]
["Period (Summer or Winter)","Summer"]
["Parent fuel grade","Diesel"]
["National fuel grade"]
["The maximum FAME content (% v/v)",0]
["Reporting Results"]
[]
["Parameter","Unit","Analytical and statistical results",null,null,null,null,null,null,null,null,"Limiting value (1)",null,null,null,"Test method"]
[null,null,null,null,null,null,null,null,null,null,null,"National Specifications",null,"According to Directive 2009/30/EC",null,"(more recent versions may also be used)"]
[null,null,"No Samples","Minimum","Maximum","Median","Mean","Standard deviation","No Samples outside 95% tolerance limit","25% of Sample Value","75% of Sample Value","Minimum","Maximum","Minimum","Maximum","Method","Date"]
["Cetane number","--",0,0,0,0,0,0,0,0,0,null,null,51,"--","EN-ISO 5165",1998]
["Density at 15 oC (2)","kg/m3",0,0,0,0,0,0,0,0,0,null,null,null,845,"EN-ISO 3675",1998]
["Distillation -- 95-%-Point","oC",0,0,0,0,0,0,0,0,0,null,null,null,360,"EN-ISO 3405",2000]
["Polycyclic aromatic hydrocarbons (PAH) (3)","% (m/m)",0,0,0,0,0,0,0,0,0,null,null,null,8,"EN 12916",2006]
["Sulphur content","mg/kg",0,0,0,0,0,0,0,0,0,null,null,null,10,"EN ISO 20846\nEN ISO 20884",2004]
["FAME Content","% v/v",0,0,0,0,0,0,0,0,0,null,null,null,"7 (4)","EN 14078",2009]
[]
[]
["Sampling Frequency"]
[]
["Number of samples in month"]
["January",0,"July",0,"(1) The limiting values are \"true values\" and were established according to the procedures for limit setting in EN 228:2008.  The results of individual measurements shall be interpreted following the criteria described in EN 228:2008."]
["February",0,"August",0]
["March",0,"September",0,"(2) In cases of dispute EN ISO 3675: 1998 shall be used"]
["April",0,"October",0,"(3) Polycyclic aromatic hydrocarbons are defined as the total aromatic hydrocarbon content less than the mono-aromatic hydrocarbons content, both as determined by EN 12916"]
["May",0,"November",0]
["June",0,"December",0,"(4) FAME shall comply with EN 14078"]
[null,null,"Summer Months Total",{"$f":"SUM(B25:B30,D25:D30)","v":0},"(5) Only for countries which are measuring MMT in Diesel"]
[]
["Other notes (optional):"]
[]
[]
[]
["Test Methods and Analysis"]
[]
["Parameter","Unit","Test specified in 98/70/EC or EN590: 590 (more recent versions may also be used)",null,null,null,null,null,null,"Notes on exceedences"]
[null,null,"Method","Date","Reproducability, R","Tolerance limits",null,null,null,"Sample location \n(S,T or R)","Values","Details/action taken"]
[null,null,null,null,null,"Minimum","Maximum","Exceeded?"]
[{"$f":"'Methods&Limits'!A81","v":"Cetane number"},{"$f":"'Methods&Limits'!B81","v":"--"},{"$f":"'Methods&Limits'!E81","v":"EN-ISO 5165"},{"$f":"'Methods&Limits'!F81","v":2020},{"$f":"'Methods&Limits'!G81","v":4.3},{"$f":"'Methods&Limits'!H81","v":48.463000000000001},null,{"$f":"IF(D14=\"\",\"\",IF(D14<F42,\"Yes\",\"\"))","v":"Yes"}]
[{"$f":"'Methods&Limits'!A82","v":"Density at 15 oC"},{"$f":"'Methods&Limits'!B82","v":"kg/m3"},{"$f":"'Methods&Limits'!E82","v":"EN-ISO 3675"},{"$f":"'Methods&Limits'!F82","v":2022},{"$f":"'Methods&Limits'!G82","v":1.2},{"$f":"'Methods&Limits'!H82","v":0},{"$f":"'Methods&Limits'!I82","v":845.70799999999997},{"$f":"IF(E15=\"\",\"\",IF(E15>G43,\"Yes\",\"\"))","v":""}]
[null,null,{"$f":"'Methods&Limits'!E83","v":"EN-ISO 12185"},{"$f":"'Methods&Limits'!F83","v":2024},{"$f":"'Methods&Limits'!G83","v":0.50847457627110937},{"$f":"'Methods&Limits'!H83","v":0},{"$f":"'Methods&Limits'!I83","v":845.3},{"$f":"IF(E15=\"\",\"\",IF(E15>G44,\"Yes\",\"\"))","v":""}]
[{"$f":"'Methods&Limits'!A84","v":"Distillation -- 95% Point"},{"$f":"'Methods&Limits'!B84","v":"oC"},{"$f":"'Methods&Limits'!E84","v":"EN-ISO 3405"},{"$f":"'Methods&Limits'!F84","v":2019},{"$f":"'Methods&Limits'!G84","v":10},{"$f":"'Methods&Limits'!H84","v":0},{"$f":"'Methods&Limits'!I84","v":365.9},{"$f":"IF(E16=\"\",\"\",IF(E16>G45,\"Yes\",\"\"))","v":""}]
[{"$f":"'Methods&Limits'!A85","v":"Polycyclic aromatic hydrocarbons"},{"$f":"'Methods&Limits'!B85","v":"% (m/m)"},{"$f":"'Methods&Limits'!E85","v":"EN 12916"},{"$f":"'Methods&Limits'!F85","v":2019},{"$f":"'Methods&Limits'!G85","v":1.9},{"$f":"'Methods&Limits'!H85","v":0},{"$f":"'Methods&Limits'!I85","v":9.1210000000000004},{"$f":"IF(E17=\"\",\"\",IF(E17>G46,\"Yes\",\"\"))","v":""}]
[{"$f":"'Methods&Limits'!A86","v":"Sulphur content (sulphur free, from 2005)"},{"$f":"'Methods&Limits'!B86","v":"mg/kg"},{"$f":"'Methods&Limits'!E86","v":"EN-ISO 20846"},{"$f":"'Methods&Limits'!F86","v":2019},{"$f":"'Methods&Limits'!G86","v":2.2000000000000002},{"$f":"'Methods&Limits'!H86","v":0},{"$f":"'Methods&Limits'!I86","v":11.298},{"$f":"IF(E18=\"\",\"\",IF(E18>G47,\"Yes\",\"\"))","v":""}]
[null,null,{"$f":"'Methods&Limits'!E87","v":"EN-ISO 20884"},{"$f":"'Methods&Limits'!F87","v":2019},{"$f":"'Methods&Limits'!G87","v":3.1},{"$f":"'Methods&Limits'!H87","v":0},{"$f":"'Methods&Limits'!I87","v":11.829000000000001},{"$f":"IF(E18=\"\",\"\",IF(E18>G48,\"Yes\",\"\"))","v":""}]
[{"$f":"'Methods&Limits'!A88","v":"FAME Content"},{"$f":"'Methods&Limits'!B88","v":"% V/V"},{"$f":"'Methods&Limits'!E88","v":"EN14078"},{"$f":"'Methods&Limits'!F88","v":2014},{"$f":"'Methods&Limits'!G88","v":0.5},{"$f":"'Methods&Limits'!H88","v":0},{"$f":"'Methods&Limits'!I88","v":10.295},{"$f":"IF(E19=\"\",\"\",IF(E19>G49,\"Yes\",\"\"))","v":""}]

{"sheet":"Diesel (4)","index":32,"n_rows":49,"n_cols":18,"rows_kept":49,"cut":false,"hidden":false,"merged":[[2,1,2,3],[2,6,9,16],[3,1,3,3],[4,1,4,3],[5,1,5,3],[6,1,6,3],[7,1,7,3],[30,4,30,13],[10,2,11,10],[10,11,10,14],[10,15,10,16],[11,11,11,12],[11,13,11,14],[11,15,11,16],[23,0,23,3],[24,4,25,13],[26,4,26,13],[27,4,28,13],[29,4,29,13],[46,11,46,12],[33,0,33,13],[38,2,38,8],[38,9,38,12],[39,5,39,6],[39,8,40,8],[39,9,40,9],[39,10,40,10],[39,11,40,12],[41,11,41,12],[42,11,42,12],[43,11,43,12],[44,11,44,12],[45,11,45,12],[47,11,47,12],[48,11,48,12],[49,0,50,0],[49,1,50,1],[50,11,50,12],[49,11,49,12]]}
["Market Fuels used in the Compression Ignition Engines (Diesel)",null,null,null,null,null,null,null,null,null,null,null,null,null,null,null,null,"<-- GO BACK"]
[]
["Country",{"$f":"IF(LEN('Contacts&Annual Summary'!C9) > 1,'Contacts&Annual Summary'!C9,\"\")","v":""},null,null,null,null,"Notes on completing the tables\nThe table structure has been locked to prevent modification - data can be copied and pasted, in bulk into the Reporting Results blue table cells.  Where a white row exists between rows, it will not be possible to paste over white rows and sections should be pasted separately.\n\nColumn H in the Test Methods and Analysis table is set to automatically check whether the numerical values entered in the Reporting Results table exceed maximum or minimum Tolerance Limits.  If any exceedance is detected, please provide details in the columns to the right including the number of samples, location samples were taken from, Values and Details of any action taken to address non-compliant samples.  Compliance information is verified manually and this automated compliance check is not solely relied upon during data analysis.\n\nPlease do not unlock this template - modified templates cannot be processed and may delay reporting."]
["Reporting year",{"$f":"'Contacts&Annual Summary'!C8","v":2023}]
["Period (Summer or Winter)","Winter"]
["Parent fuel grade","Diesel"]
["National fuel grade",{"$f":"'Diesel (3)'!B7","v":0}]
["The maximum FAME content (% v/v)",0]
["Reporting Results"]
[]
["Parameter","Unit","Analytical and statistical results",null,null,null,null,null,null,null,null,"Limiting value (1)",null,null,null,"Test method"]
[null,null,null,null,null,null,null,null,null,null,null,"National Specifications",null,"According to Directive 2009/30/EC",null,"(more recent versions may also be used)"]
[null,null,"No Samples","Minimum","Maximum","Median","Mean","Standard deviation","No Samples outside 95% tolerance limit","25% of Sample Value","75% of Sample Value","Minimum","Maximum","Minimum","Maximum","Method","Date"]
["Cetane number","--",0,0,0,0,0,0,0,0,0,null,null,51,"--","EN-ISO 5165",1998]
["Density at 15 oC (2)","kg/m3",0,0,0,0,0,0,0,0,0,null,null,null,845,"EN-ISO 3675",1998]
["Distillation -- 95-%-Point","oC",0,0,0,0,0,0,0,0,0,null,null,null,360,"EN-ISO 3405",2000]
["Polycyclic aromatic hydrocarbons (PAH) (3)","% (m/m)",0,0,0,0,0,0,0,0,0,null,null,null,8,"EN 12916",2006]
["Sulphur content","mg/kg",0,0,0,0,0,0,0,0,0,null,null,null,10,"EN ISO 20846\nEN ISO 20884",2004]
["FAME Content","% v/v",0,0,0,0,0,0,0,0,0,null,null,null,"7 (4)","EN 14078",2009]
[]
[]
["Sampling Frequency"]
[]
["Number of samples in month"]
["January",0,"July",0,"(1) The limiting values are \"true values\" and were established according to the procedures for limit setting in EN 228:2008.  The results of individual measurements shall be interpreted following the criteria described in EN 228:2008."]
["February",0,"August",0]
["March",0,"September",0,"(2) In cases of dispute EN ISO 3675: 1998 shall be used"]
["April",0,"October",0,"(3) Polycyclic aromatic hydrocarbons are defined as the total aromatic hydrocarbon content less than the mono-aromatic hydrocarbons content, both as determined by EN 12916"]
["May",0,"November",0]
["June",0,"December",0,"(4) FAME shall comply with EN 14078"]
[null,null,"Winter Months Total",{"$f":"SUM(B25:B30,D25:D30)","v":0},"(5) Only for countries which are measuring MMT in Diesel"]
[]
["Other notes (optional):"]
[]
[]
[]
["Test Methods and Analysis"]
[]
["Parameter","Unit","Test specified in 98/70/EC or EN590: 590 (more recent versions may also be used)",null,null,null,null,null,null,"Notes on exceedences"]
[null,null,"Method","Date","Reproducability, R","Tolerance limits",null,null,null,"Sample location \n(S,T or R)","Values","Details/action taken"]
[null,null,null,null,null,"Minimum","Maximum","Exceeded?"]
[{"$f":"'Methods&Limits'!A81","v":"Cetane number"},{"$f":"'Methods&Limits'!B81","v":"--"},{"$f":"'Methods&Limits'!E81","v":"EN-ISO 5165"},{"$f":"'Methods&Limits'!F81","v":2020},{"$f":"'Methods&Limits'!G81","v":4.3},{"$f":"'Methods&Limits'!H81","v":48.463000000000001},null,{"$f":"IF(D14=\"\",\"\",IF(D14<F42,\"Yes\",\"\"))","v":"Yes"}]
[{"$f":"'Methods&Limits'!A82","v":"Density at 15 oC"},{"$f":"'Methods&Limits'!B82","v":"kg/m3"},{"$f":"'Methods&Limits'!E82","v":"EN-ISO 3675"},{"$f":"'Methods&Limits'!F82","v":2022},{"$f":"'Methods&Limits'!G82","v":1.2},{"$f":"'Methods&Limits'!H82","v":0},{"$f":"'Methods&Limits'!I82","v":845.70799999999997},{"$f":"IF(E15=\"\",\"\",IF(E15>G43,\"Yes\",\"\"))","v":""}]
[null,null,{"$f":"'Methods&Limits'!E83","v":"EN-ISO 12185"},{"$f":"'Methods&Limits'!F83","v":2024},{"$f":"'Methods&Limits'!G83","v":0.50847457627110937},{"$f":"'Methods&Limits'!H83","v":0},{"$f":"'Methods&Limits'!I83","v":845.3},{"$f":"IF(E15=\"\",\"\",IF(E15>G44,\"Yes\",\"\"))","v":""}]
[{"$f":"'Methods&Limits'!A84","v":"Distillation -- 95% Point"},{"$f":"'Methods&Limits'!B84","v":"oC"},{"$f":"'Methods&Limits'!E84","v":"EN-ISO 3405"},{"$f":"'Methods&Limits'!F84","v":2019},{"$f":"'Methods&Limits'!G84","v":10},{"$f":"'Methods&Limits'!H84","v":0},{"$f":"'Methods&Limits'!I84","v":365.9},{"$f":"IF(E16=\"\",\"\",IF(E16>G45,\"Yes\",\"\"))","v":""}]
[{"$f":"'Methods&Limits'!A85","v":"Polycyclic aromatic hydrocarbons"},{"$f":"'Methods&Limits'!B85","v":"% (m/m)"},{"$f":"'Methods&Limits'!E85","v":"EN 12916"},{"$f":"'Methods&Limits'!F85","v":2019},{"$f":"'Methods&Limits'!G85","v":1.9},{"$f":"'Methods&Limits'!H85","v":0},{"$f":"'Methods&Limits'!I85","v":9.1210000000000004},{"$f":"IF(E17=\"\",\"\",IF(E17>G46,\"Yes\",\"\"))","v":""}]
[{"$f":"'Methods&Limits'!A86","v":"Sulphur content (sulphur free, from 2005)"},{"$f":"'Methods&Limits'!B86","v":"mg/kg"},{"$f":"'Methods&Limits'!E86","v":"EN-ISO 20846"},{"$f":"'Methods&Limits'!F86","v":2019},{"$f":"'Methods&Limits'!G86","v":2.2000000000000002},{"$f":"'Methods&Limits'!H86","v":0},{"$f":"'Methods&Limits'!I86","v":11.298},{"$f":"IF(E18=\"\",\"\",IF(E18>G47,\"Yes\",\"\"))","v":""}]
[null,null,{"$f":"'Methods&Limits'!E87","v":"EN-ISO 20884"},{"$f":"'Methods&Limits'!F87","v":2019},{"$f":"'Methods&Limits'!G87","v":3.1},{"$f":"'Methods&Limits'!H87","v":0},{"$f":"'Methods&Limits'!I87","v":11.829000000000001},{"$f":"IF(E18=\"\",\"\",IF(E18>G48,\"Yes\",\"\"))","v":""}]
[{"$f":"'Methods&Limits'!A88","v":"FAME Content"},{"$f":"'Methods&Limits'!B88","v":"% V/V"},{"$f":"'Methods&Limits'!E88","v":"EN14078"},{"$f":"'Methods&Limits'!F88","v":2014},{"$f":"'Methods&Limits'!G88","v":0.5},{"$f":"'Methods&Limits'!H88","v":0},{"$f":"'Methods&Limits'!I88","v":10.295},{"$f":"IF(E19=\"\",\"\",IF(E19>G49,\"Yes\",\"\"))","v":""}]

{"sheet":"Diesel (3+4)","index":33,"n_rows":49,"n_cols":18,"rows_kept":49,"cut":false,"hidden":false,"merged":[[2,1,2,3],[2,6,9,16],[3,1,3,3],[4,1,4,3],[5,1,5,3],[6,1,6,3],[7,1,7,3],[30,4,30,13],[10,2,11,10],[10,11,10,14],[10,15,10,16],[11,11,11,12],[11,13,11,14],[11,15,11,16],[23,0,23,3],[24,4,25,13],[26,4,26,13],[27,4,28,13],[29,4,29,13],[46,11,46,12],[33,0,33,13],[38,2,38,8],[38,9,38,12],[39,5,39,6],[39,8,40,8],[39,9,40,9],[39,10,40,10],[39,11,40,12],[41,11,41,12],[42,11,42,12],[43,11,43,12],[44,11,44,12],[45,11,45,12],[47,11,47,12],[48,11,48,12],[49,0,50,0],[49,1,50,1],[50,11,50,12],[49,11,49,12]]}
["Market Fuels used in the Compression Ignition Engines (Diesel)",null,null,null,null,null,null,null,null,null,null,null,null,null,null,null,null,"<-- GO BACK"]
[]
["Country",{"$f":"IF(LEN('Contacts&Annual Summary'!C9) > 1,'Contacts&Annual Summary'!C9,\"\")","v":""},null,null,null,null,"Notes on completing the tables\nThe table structure has been locked to prevent modification - data can be copied and pasted, in bulk into the Reporting Results blue table cells.  Where a white row exists between rows, it will not be possible to paste over white rows and sections should be pasted separately.\n\nColumn H in the Test Methods and Analysis table is set to automatically check whether the numerical values entered in the Reporting Results table exceed maximum or minimum Tolerance Limits.  If any exceedance is detected, please provide details in the columns to the right including the number of samples, location samples were taken from, Values and Details of any action taken to address non-compliant samples.  Compliance information is verified manually and this automated compliance check is not solely relied upon during data analysis.\n\nPlease do not unlock this template - modified templates cannot be processed and may delay reporting."]
["Reporting year",{"$f":"'Contacts&Annual Summary'!C8","v":2023}]
["Period (Summer or Winter)","Full Year"]
["Parent fuel grade","Diesel"]
["National fuel grade",{"$f":"'Diesel (3)'!B7","v":0}]
["The maximum FAME content (% v/v)",{"$f":"MAX('Diesel (3)'!B8:D8,'Diesel (4)'!B8:D8)","v":0}]
["Reporting Results"]
[]
["Parameter","Unit","Analytical and statistical results",null,null,null,null,null,null,null,null,"Limiting value (1)",null,null,null,"Test method"]
[null,null,null,null,null,null,null,null,null,null,null,"National Specifications",null,"According to Directive 2009/30/EC",null,"(more recent versions may also be used)"]
[null,null,"No Samples","Minimum","Maximum","Median","Mean","Standard deviation","No Samples outside 95% tolerance limit","25% of Sample Value","75% of Sample Value","Minimum","Maximum","Minimum","Maximum","Method","Date"]
["Cetane number","--",{"$f":"IF(AND('Diesel (3)'!C14=\"\",'Diesel (4)'!C14=\"\"),\"\",SUM('Diesel (3)'!C14,'Diesel (4)'!C14))","v":0},{"$f":"IF(AND('Diesel (3)'!D14=\"\",'Diesel (4)'!D14=\"\"),\"\",MIN('Diesel (3)'!D14,'Diesel (4)'!D14))","v":0},{"$f":"IF(AND('Diesel (3)'!E14=\"\",'Diesel (4)'!E14=\"\"),\"\",MAX('Diesel (3)'!E14,'Diesel (4)'!E14))","v":0},0,0,0,{"$f":"IF(AND('Diesel (3)'!I14=\"\",'Diesel (4)'!I14=\"\"),\"\",SUM('Diesel (3)'!I14,'Diesel (4)'!I14))","v":0},0,0,null,null,51,"--","EN-ISO 5165",1998]
["Density at 15 oC (2)","kg/m3",{"$f":"IF(AND('Diesel (3)'!C15=\"\",'Diesel (4)'!C15=\"\"),\"\",SUM('Diesel (3)'!C15,'Diesel (4)'!C15))","v":0},{"$f":"IF(AND('Diesel (3)'!D15=\"\",'Diesel (4)'!D15=\"\"),\"\",MIN('Diesel (3)'!D15,'Diesel (4)'!D15))","v":0},{"$f":"IF(AND('Diesel (3)'!E15=\"\",'Diesel (4)'!E15=\"\"),\"\",MAX('Diesel (3)'!E15,'Diesel (4)'!E15))","v":0},0,0,0,{"$f":"IF(AND('Diesel (3)'!I15=\"\",'Diesel (4)'!I15=\"\"),\"\",SUM('Diesel (3)'!I15,'Diesel (4)'!I15))","v":0},0,0,null,null,null,845,"EN-ISO 3675",1998]
["Distillation -- 95-%-Point","oC",{"$f":"IF(AND('Diesel (3)'!C16=\"\",'Diesel (4)'!C16=\"\"),\"\",SUM('Diesel (3)'!C16,'Diesel (4)'!C16))","v":0},{"$f":"IF(AND('Diesel (3)'!D16=\"\",'Diesel (4)'!D16=\"\"),\"\",MIN('Diesel (3)'!D16,'Diesel (4)'!D16))","v":0},{"$f":"IF(AND('Diesel (3)'!E16=\"\",'Diesel (4)'!E16=\"\"),\"\",MAX('Diesel (3)'!E16,'Diesel (4)'!E16))","v":0},0,0,0,{"$f":"IF(AND('Diesel (3)'!I16=\"\",'Diesel (4)'!I16=\"\"),\"\",SUM('Diesel (3)'!I16,'Diesel (4)'!I16))","v":0},0,0,null,null,null,360,"EN-ISO 3405",2000]
["Polycyclic aromatic hydrocarbons (PAH) (3)","% (m/m)",{"$f":"IF(AND('Diesel (3)'!C17=\"\",'Diesel (4)'!C17=\"\"),\"\",SUM('Diesel (3)'!C17,'Diesel (4)'!C17))","v":0},{"$f":"IF(AND('Diesel (3)'!D17=\"\",'Diesel (4)'!D17=\"\"),\"\",MIN('Diesel (3)'!D17,'Diesel (4)'!D17))","v":0},{"$f":"IF(AND('Diesel (3)'!E17=\"\",'Diesel (4)'!E17=\"\"),\"\",MAX('Diesel (3)'!E17,'Diesel (4)'!E17))","v":0},0,0,0,{"$f":"IF(AND('Diesel (3)'!I17=\"\",'Diesel (4)'!I17=\"\"),\"\",SUM('Diesel (3)'!I17,'Diesel (4)'!I17))","v":0},0,0,null,null,null,8,"EN 12916",2006]
["Sulphur content","mg/kg",{"$f":"IF(AND('Diesel (3)'!C18=\"\",'Diesel (4)'!C18=\"\"),\"\",SUM('Diesel (3)'!C18,'Diesel (4)'!C18))","v":0},{"$f":"IF(AND('Diesel (3)'!D18=\"\",'Diesel (4)'!D18=\"\"),\"\",MIN('Diesel (3)'!D18,'Diesel (4)'!D18))","v":0},{"$f":"IF(AND('Diesel (3)'!E18=\"\",'Diesel (4)'!E18=\"\"),\"\",MAX('Diesel (3)'!E18,'Diesel (4)'!E18))","v":0},0,0,0,{"$f":"IF(AND('Diesel (3)'!I18=\"\",'Diesel (4)'!I18=\"\"),\"\",SUM('Diesel (3)'!I18,'Diesel (4)'!I18))","v":0},0,0,null,null,null,10,"EN ISO 20846\nEN ISO 20884",2004]
["FAME Content","% v/v",{"$f":"IF(AND('Diesel (3)'!C19=\"\",'Diesel (4)'!C19=\"\"),\"\",SUM('Diesel (3)'!C19,'Diesel (4)'!C19))","v":0},{"$f":"IF(AND('Diesel (3)'!D19=\"\",'Diesel (4)'!D19=\"\"),\"\",MIN('Diesel (3)'!D19,'Diesel (4)'!D19))","v":0},{"$f":"IF(AND('Diesel (3)'!E19=\"\",'Diesel (4)'!E19=\"\"),\"\",MAX('Diesel (3)'!E19,'Diesel (4)'!E19))","v":0},0,0,0,{"$f":"IF(AND('Diesel (3)'!I19=\"\",'Diesel (4)'!I19=\"\"),\"\",SUM('Diesel (3)'!I19,'Diesel (4)'!I19))","v":0},0,0,null,null,null,"7 (4)","EN 14078",2009]
[]
[]
["Sampling Frequency"]
[]
["Number of samples in month"]
["January",{"$f":"'Diesel (3)'!B25+'Diesel (4)'!B25","v":0},"July",{"$f":"'Diesel (3)'!D25+'Diesel (4)'!D25","v":0},"(1) The limiting values are \"true values\" and were established according to the procedures for limit setting in EN 228:2008.  The results of individual measurements shall be interpreted following the criteria described in EN 228:2008."]
["February",{"$f":"'Diesel (3)'!B26+'Diesel (4)'!B26","v":0},"August",{"$f":"'Diesel (3)'!D26+'Diesel (4)'!D26","v":0}]
["March",{"$f":"'Diesel (3)'!B27+'Diesel (4)'!B27","v":0},"September",{"$f":"'Diesel (3)'!D27+'Diesel (4)'!D27","v":0},"(2) In cases of dispute EN ISO 3675: 1998 shall be used"]
["April",{"$f":"'Diesel (3)'!B28+'Diesel (4)'!B28","v":0},"October",{"$f":"'Diesel (3)'!D28+'Diesel (4)'!D28","v":0},"(3) Polycyclic aromatic hydrocarbons are defined as the total aromatic hydrocarbon content less than the mono-aromatic hydrocarbons content, both as determined by EN 12916"]
["May",{"$f":"'Diesel (3)'!B29+'Diesel (4)'!B29","v":0},"November",{"$f":"'Diesel (3)'!D29+'Diesel (4)'!D29","v":0}]
["June",{"$f":"'Diesel (3)'!B30+'Diesel (4)'!B30","v":0},"December",{"$f":"'Diesel (3)'!D30+'Diesel (4)'!D30","v":0},"(4) FAME shall comply with EN 14078"]
[null,null,"Full Year Total",{"$f":"SUM(B25:B30,D25:D30)","v":0},"(5) Only for countries which are measuring MMT in Diesel"]
[]
["Other notes (optional):"]
[]
[]
[]
["Test Methods and Analysis",null,null,null,null,null,null,null,null,"Only if not provided in Summer and Winter sheets"]
[]
["Parameter","Unit","Test specified in 98/70/EC or EN590: 590 (more recent versions may also be used)",null,null,null,null,null,null,"Notes on exceedences"]
[null,null,"Method","Date","Reproducability, R","Tolerance limits",null,null,null,"Sample location \n(S,T or R)","Values","Details/action taken"]
[null,null,null,null,null,"Minimum","Maximum","Exceeded?"]
[{"$f":"'Methods&Limits'!A81","v":"Cetane number"},{"$f":"'Methods&Limits'!B81","v":"--"},{"$f":"'Methods&Limits'!E81","v":"EN-ISO 5165"},{"$f":"'Methods&Limits'!F81","v":2020},{"$f":"'Methods&Limits'!G81","v":4.3},{"$f":"'Methods&Limits'!H81","v":48.463000000000001},null,{"$f":"IF(D14=\"\",\"\",IF(D14<F42,\"Yes\",\"\"))","v":"Yes"}]
[{"$f":"'Methods&Limits'!A82","v":"Density at 15 oC"},{"$f":"'Methods&Limits'!B82","v":"kg/m3"},{"$f":"'Methods&Limits'!E82","v":"EN-ISO 3675"},{"$f":"'Methods&Limits'!F82","v":2022},{"$f":"'Methods&Limits'!G82","v":1.2},{"$f":"'Methods&Limits'!H82","v":0},{"$f":"'Methods&Limits'!I82","v":845.70799999999997},{"$f":"IF(E15=\"\",\"\",IF(E15>G43,\"Yes\",\"\"))","v":""}]
[null,null,{"$f":"'Methods&Limits'!E83","v":"EN-ISO 12185"},{"$f":"'Methods&Limits'!F83","v":2024},{"$f":"'Methods&Limits'!G83","v":0.50847457627110937},{"$f":"'Methods&Limits'!H83","v":0},{"$f":"'Methods&Limits'!I83","v":845.3},{"$f":"IF(E15=\"\",\"\",IF(E15>G44,\"Yes\",\"\"))","v":""}]
[{"$f":"'Methods&Limits'!A84","v":"Distillation -- 95% Point"},{"$f":"'Methods&Limits'!B84","v":"oC"},{"$f":"'Methods&Limits'!E84","v":"EN-ISO 3405"},{"$f":"'Methods&Limits'!F84","v":2019},{"$f":"'Methods&Limits'!G84","v":10},{"$f":"'Methods&Limits'!H84","v":0},{"$f":"'Methods&Limits'!I84","v":365.9},{"$f":"IF(E16=\"\",\"\",IF(E16>G45,\"Yes\",\"\"))","v":""}]
[{"$f":"'Methods&Limits'!A85","v":"Polycyclic aromatic hydrocarbons"},{"$f":"'Methods&Limits'!B85","v":"% (m/m)"},{"$f":"'Methods&Limits'!E85","v":"EN 12916"},{"$f":"'Methods&Limits'!F85","v":2019},{"$f":"'Methods&Limits'!G85","v":1.9},{"$f":"'Methods&Limits'!H85","v":0},{"$f":"'Methods&Limits'!I85","v":9.1210000000000004},{"$f":"IF(E17=\"\",\"\",IF(E17>G46,\"Yes\",\"\"))","v":""}]
[{"$f":"'Methods&Limits'!A86","v":"Sulphur content (sulphur free, from 2005)"},{"$f":"'Methods&Limits'!B86","v":"mg/kg"},{"$f":"'Methods&Limits'!E86","v":"EN-ISO 20846"},{"$f":"'Methods&Limits'!F86","v":2019},{"$f":"'Methods&Limits'!G86","v":2.2000000000000002},{"$f":"'Methods&Limits'!H86","v":0},{"$f":"'Methods&Limits'!I86","v":11.298},{"$f":"IF(E18=\"\",\"\",IF(E18>G47,\"Yes\",\"\"))","v":""}]
[null,null,{"$f":"'Methods&Limits'!E87","v":"EN-ISO 20884"},{"$f":"'Methods&Limits'!F87","v":2019},{"$f":"'Methods&Limits'!G87","v":3.1},{"$f":"'Methods&Limits'!H87","v":0},{"$f":"'Methods&Limits'!I87","v":11.829000000000001},{"$f":"IF(E18=\"\",\"\",IF(E18>G48,\"Yes\",\"\"))","v":""}]
[{"$f":"'Methods&Limits'!A88","v":"FAME Content"},{"$f":"'Methods&Limits'!B88","v":"% V/V"},{"$f":"'Methods&Limits'!E88","v":"EN14078"},{"$f":"'Methods&Limits'!F88","v":2014},{"$f":"'Methods&Limits'!G88","v":0.5},{"$f":"'Methods&Limits'!H88","v":0},{"$f":"'Methods&Limits'!I88","v":10.295},{"$f":"IF(E19=\"\",\"\",IF(E19>G49,\"Yes\",\"\"))","v":""}]

{"sheet":"Diesel (5)","index":34,"n_rows":49,"n_cols":18,"rows_kept":49,"cut":false,"hidden":false,"merged":[[2,1,2,3],[2,6,9,16],[3,1,3,3],[4,1,4,3],[5,1,5,3],[6,1,6,3],[7,1,7,3],[30,4,30,13],[10,2,11,10],[10,11,10,14],[10,15,10,16],[11,11,11,12],[11,13,11,14],[11,15,11,16],[23,0,23,3],[24,4,25,13],[26,4,26,13],[27,4,28,13],[29,4,29,13],[46,11,46,12],[33,0,33,13],[38,2,38,8],[38,9,38,12],[39,5,39,6],[39,8,40,8],[39,9,40,9],[39,10,40,10],[39,11,40,12],[41,11,41,12],[42,11,42,12],[43,11,43,12],[44,11,44,12],[45,11,45,12],[47,11,47,12],[48,11,48,12],[49,0,50,0],[49,1,50,1],[50,11,50,12],[49,11,49,12]]}
["Market Fuels used in the Compression Ignition Engines (Diesel)",null,null,null,null,null,null,null,null,null,null,null,null,null,null,null,null,"<-- GO BACK"]
[]
["Country",{"$f":"IF(LEN('Contacts&Annual Summary'!C9) > 1,'Contacts&Annual Summary'!C9,\"\")","v":""},null,null,null,null,"Notes on completing the tables\nThe table structure has been locked to prevent modification - data can be copied and pasted, in bulk into the Reporting Results blue table cells.  Where a white row exists between rows, it will not be possible to paste over white rows and sections should be pasted separately.\n\nColumn H in the Test Methods and Analysis table is set to automatically check whether the numerical values entered in the Reporting Results table exceed maximum or minimum Tolerance Limits.  If any exceedance is detected, please provide details in the columns to the right including the number of samples, location samples were taken from, Values and Details of any action taken to address non-compliant samples.  Compliance information is verified manually and this automated compliance check is not solely relied upon during data analysis.\n\nPlease do not unlock this template - modified templates cannot be processed and may delay reporting."]
["Reporting year",{"$f":"'Contacts&Annual Summary'!C8","v":2023}]
["Period (Summer or Winter)","Summer"]
["Parent fuel grade","Diesel"]
["National fuel grade"]
["The maximum FAME content (% v/v)",0]
["Reporting Results"]
[]
["Parameter","Unit","Analytical and statistical results",null,null,null,null,null,null,null,null,"Limiting value (1)",null,null,null,"Test method"]
[null,null,null,null,null,null,null,null,null,null,null,"National Specifications",null,"According to Directive 2009/30/EC",null,"(more recent versions may also be used)"]
[null,null,"No Samples","Minimum","Maximum","Median","Mean","Standard deviation","No Samples outside 95% tolerance limit","25% of Sample Value","75% of Sample Value","Minimum","Maximum","Minimum","Maximum","Method","Date"]
["Cetane number","--",0,0,0,0,0,0,0,0,0,null,null,51,"--","EN-ISO 5165",1998]
["Density at 15 oC (2)","kg/m3",0,0,0,0,0,0,0,0,0,null,null,null,845,"EN-ISO 3675",1998]
["Distillation -- 95-%-Point","oC",0,0,0,0,0,0,0,0,0,null,null,null,360,"EN-ISO 3405",2000]
["Polycyclic aromatic hydrocarbons (PAH) (3)","% (m/m)",0,0,0,0,0,0,0,0,0,null,null,null,8,"EN 12916",2006]
["Sulphur content","mg/kg",0,0,0,0,0,0,0,0,0,null,null,null,10,"EN ISO 20846\nEN ISO 20884",2004]
["FAME Content","% v/v",0,0,0,0,0,0,0,0,0,null,null,null,"7 (4)","EN 14078",2009]
[]
[]
["Sampling Frequency"]
[]
["Number of samples in month"]
["January",0,"July",0,"(1) The limiting values are \"true values\" and were established according to the procedures for limit setting in EN 228:2008.  The results of individual measurements shall be interpreted following the criteria described in EN 228:2008."]
["February",0,"August",0]
["March",0,"September",0,"(2) In cases of dispute EN ISO 3675: 1998 shall be used"]
["April",0,"October",0,"(3) Polycyclic aromatic hydrocarbons are defined as the total aromatic hydrocarbon content less than the mono-aromatic hydrocarbons content, both as determined by EN 12916"]
["May",0,"November",0]
["June",0,"December",0,"(4) FAME shall comply with EN 14078"]
[null,null,"Summer Months Total",{"$f":"SUM(B25:B30,D25:D30)","v":0},"(5) Only for countries which are measuring MMT in Diesel"]
[]
["Other notes (optional):"]
[]
[]
[]
["Test Methods and Analysis"]
[]
["Parameter","Unit","Test specified in 98/70/EC or EN590: 590 (more recent versions may also be used)",null,null,null,null,null,null,"Notes on exceedences"]
[null,null,"Method","Date","Reproducability, R","Tolerance limits",null,null,null,"Sample location \n(S,T or R)","Values","Details/action taken"]
[null,null,null,null,null,"Minimum","Maximum","Exceeded?"]
[{"$f":"'Methods&Limits'!A81","v":"Cetane number"},{"$f":"'Methods&Limits'!B81","v":"--"},{"$f":"'Methods&Limits'!E81","v":"EN-ISO 5165"},{"$f":"'Methods&Limits'!F81","v":2020},{"$f":"'Methods&Limits'!G81","v":4.3},{"$f":"'Methods&Limits'!H81","v":48.463000000000001},null,{"$f":"IF(D14=\"\",\"\",IF(D14<F42,\"Yes\",\"\"))","v":"Yes"}]
[{"$f":"'Methods&Limits'!A82","v":"Density at 15 oC"},{"$f":"'Methods&Limits'!B82","v":"kg/m3"},{"$f":"'Methods&Limits'!E82","v":"EN-ISO 3675"},{"$f":"'Methods&Limits'!F82","v":2022},{"$f":"'Methods&Limits'!G82","v":1.2},{"$f":"'Methods&Limits'!H82","v":0},{"$f":"'Methods&Limits'!I82","v":845.70799999999997},{"$f":"IF(E15=\"\",\"\",IF(E15>G43,\"Yes\",\"\"))","v":""}]
[null,null,{"$f":"'Methods&Limits'!E83","v":"EN-ISO 12185"},{"$f":"'Methods&Limits'!F83","v":2024},{"$f":"'Methods&Limits'!G83","v":0.50847457627110937},{"$f":"'Methods&Limits'!H83","v":0},{"$f":"'Methods&Limits'!I83","v":845.3},{"$f":"IF(E15=\"\",\"\",IF(E15>G44,\"Yes\",\"\"))","v":""}]
[{"$f":"'Methods&Limits'!A84","v":"Distillation -- 95% Point"},{"$f":"'Methods&Limits'!B84","v":"oC"},{"$f":"'Methods&Limits'!E84","v":"EN-ISO 3405"},{"$f":"'Methods&Limits'!F84","v":2019},{"$f":"'Methods&Limits'!G84","v":10},{"$f":"'Methods&Limits'!H84","v":0},{"$f":"'Methods&Limits'!I84","v":365.9},{"$f":"IF(E16=\"\",\"\",IF(E16>G45,\"Yes\",\"\"))","v":""}]
[{"$f":"'Methods&Limits'!A85","v":"Polycyclic aromatic hydrocarbons"},{"$f":"'Methods&Limits'!B85","v":"% (m/m)"},{"$f":"'Methods&Limits'!E85","v":"EN 12916"},{"$f":"'Methods&Limits'!F85","v":2019},{"$f":"'Methods&Limits'!G85","v":1.9},{"$f":"'Methods&Limits'!H85","v":0},{"$f":"'Methods&Limits'!I85","v":9.1210000000000004},{"$f":"IF(E17=\"\",\"\",IF(E17>G46,\"Yes\",\"\"))","v":""}]
[{"$f":"'Methods&Limits'!A86","v":"Sulphur content (sulphur free, from 2005)"},{"$f":"'Methods&Limits'!B86","v":"mg/kg"},{"$f":"'Methods&Limits'!E86","v":"EN-ISO 20846"},{"$f":"'Methods&Limits'!F86","v":2019},{"$f":"'Methods&Limits'!G86","v":2.2000000000000002},{"$f":"'Methods&Limits'!H86","v":0},{"$f":"'Methods&Limits'!I86","v":11.298},{"$f":"IF(E18=\"\",\"\",IF(E18>G47,\"Yes\",\"\"))","v":""}]
[null,null,{"$f":"'Methods&Limits'!E87","v":"EN-ISO 20884"},{"$f":"'Methods&Limits'!F87","v":2019},{"$f":"'Methods&Limits'!G87","v":3.1},{"$f":"'Methods&Limits'!H87","v":0},{"$f":"'Methods&Limits'!I87","v":11.829000000000001},{"$f":"IF(E18=\"\",\"\",IF(E18>G48,\"Yes\",\"\"))","v":""}]
[{"$f":"'Methods&Limits'!A88","v":"FAME Content"},{"$f":"'Methods&Limits'!B88","v":"% V/V"},{"$f":"'Methods&Limits'!E88","v":"EN14078"},{"$f":"'Methods&Limits'!F88","v":2014},{"$f":"'Methods&Limits'!G88","v":0.5},{"$f":"'Methods&Limits'!H88","v":0},{"$f":"'Methods&Limits'!I88","v":10.295},{"$f":"IF(E19=\"\",\"\",IF(E19>G49,\"Yes\",\"\"))","v":""}]

{"sheet":"Diesel (6)","index":35,"n_rows":49,"n_cols":18,"rows_kept":49,"cut":false,"hidden":false,"merged":[[2,1,2,3],[2,6,9,16],[3,1,3,3],[4,1,4,3],[5,1,5,3],[6,1,6,3],[7,1,7,3],[30,4,30,13],[10,2,11,10],[10,11,10,14],[10,15,10,16],[11,11,11,12],[11,13,11,14],[11,15,11,16],[23,0,23,3],[24,4,25,13],[26,4,26,13],[27,4,28,13],[29,4,29,13],[46,11,46,12],[33,0,33,13],[38,2,38,8],[38,9,38,12],[39,5,39,6],[39,8,40,8],[39,9,40,9],[39,10,40,10],[39,11,40,12],[41,11,41,12],[42,11,42,12],[43,11,43,12],[44,11,44,12],[45,11,45,12],[47,11,47,12],[48,11,48,12],[49,0,50,0],[49,1,50,1],[50,11,50,12],[49,11,49,12]]}
["Market Fuels used in the Compression Ignition Engines (Diesel)",null,null,null,null,null,null,null,null,null,null,null,null,null,null,null,null,"<-- GO BACK"]
[]
["Country",{"$f":"IF(LEN('Contacts&Annual Summary'!C9) > 1,'Contacts&Annual Summary'!C9,\"\")","v":""},null,null,null,null,"Notes on completing the tables\nThe table structure has been locked to prevent modification - data can be copied and pasted, in bulk into the Reporting Results blue table cells.  Where a white row exists between rows, it will not be possible to paste over white rows and sections should be pasted separately.\n\nColumn H in the Test Methods and Analysis table is set to automatically check whether the numerical values entered in the Reporting Results table exceed maximum or minimum Tolerance Limits.  If any exceedance is detected, please provide details in the columns to the right including the number of samples, location samples were taken from, Values and Details of any action taken to address non-compliant samples.  Compliance information is verified manually and this automated compliance check is not solely relied upon during data analysis.\n\nPlease do not unlock this template - modified templates cannot be processed and may delay reporting."]
["Reporting year",{"$f":"'Contacts&Annual Summary'!C8","v":2023}]
["Period (Summer or Winter)","Winter"]
["Parent fuel grade","Diesel"]
["National fuel grade",{"$f":"'Diesel (5)'!B7","v":0}]
["The maximum FAME content (% v/v)",0]
["Reporting Results"]
[]
["Parameter","Unit","Analytical and statistical results",null,null,null,null,null,null,null,null,"Limiting value (1)",null,null,null,"Test method"]
[null,null,null,null,null,null,null,null,null,null,null,"National Specifications",null,"According to Directive 2009/30/EC",null,"(more recent versions may also be used)"]
[null,null,"No Samples","Minimum","Maximum","Median","Mean","Standard deviation","No Samples outside 95% tolerance limit","25% of Sample Value","75% of Sample Value","Minimum","Maximum","Minimum","Maximum","Method","Date"]
["Cetane number","--",0,0,0,0,0,0,0,0,0,null,null,51,"--","EN-ISO 5165",1998]
["Density at 15 oC (2)","kg/m3",0,0,0,0,0,0,0,0,0,null,null,null,845,"EN-ISO 3675",1998]
["Distillation -- 95-%-Point","oC",0,0,0,0,0,0,0,0,0,null,null,null,360,"EN-ISO 3405",2000]
["Polycyclic aromatic hydrocarbons (PAH) (3)","% (m/m)",0,0,0,0,0,0,0,0,0,null,null,null,8,"EN 12916",2006]
["Sulphur content","mg/kg",0,0,0,0,0,0,0,0,0,null,null,null,10,"EN ISO 20846\nEN ISO 20884",2004]
["FAME Content","% v/v",0,0,0,0,0,0,0,0,0,null,null,null,"7 (4)","EN 14078",2009]
[]
[]
["Sampling Frequency"]
[]
["Number of samples in month"]
["January",0,"July",0,"(1) The limiting values are \"true values\" and were established according to the procedures for limit setting in EN 228:2008.  The results of individual measurements shall be interpreted following the criteria described in EN 228:2008."]
["February",0,"August",0]
["March",0,"September",0,"(2) In cases of dispute EN ISO 3675: 1998 shall be used"]
["April",0,"October",0,"(3) Polycyclic aromatic hydrocarbons are defined as the total aromatic hydrocarbon content less than the mono-aromatic hydrocarbons content, both as determined by EN 12916"]
["May",0,"November",0]
["June",0,"December",0,"(4) FAME shall comply with EN 14078"]
[null,null,"Winter Months Total",{"$f":"SUM(B25:B30,D25:D30)","v":0},"(5) Only for countries which are measuring MMT in Diesel"]
[]
["Other notes (optional):"]
[]
[]
[]
["Test Methods and Analysis"]
[]
["Parameter","Unit","Test specified in 98/70/EC or EN590: 590 (more recent versions may also be used)",null,null,null,null,null,null,"Notes on exceedences"]
[null,null,"Method","Date","Reproducability, R","Tolerance limits",null,null,null,"Sample location \n(S,T or R)","Values","Details/action taken"]
[null,null,null,null,null,"Minimum","Maximum","Exceeded?"]
[{"$f":"'Methods&Limits'!A81","v":"Cetane number"},{"$f":"'Methods&Limits'!B81","v":"--"},{"$f":"'Methods&Limits'!E81","v":"EN-ISO 5165"},{"$f":"'Methods&Limits'!F81","v":2020},{"$f":"'Methods&Limits'!G81","v":4.3},{"$f":"'Methods&Limits'!H81","v":48.463000000000001},null,{"$f":"IF(D14=\"\",\"\",IF(D14<F42,\"Yes\",\"\"))","v":"Yes"}]
[{"$f":"'Methods&Limits'!A82","v":"Density at 15 oC"},{"$f":"'Methods&Limits'!B82","v":"kg/m3"},{"$f":"'Methods&Limits'!E82","v":"EN-ISO 3675"},{"$f":"'Methods&Limits'!F82","v":2022},{"$f":"'Methods&Limits'!G82","v":1.2},{"$f":"'Methods&Limits'!H82","v":0},{"$f":"'Methods&Limits'!I82","v":845.70799999999997},{"$f":"IF(E15=\"\",\"\",IF(E15>G43,\"Yes\",\"\"))","v":""}]
[null,null,{"$f":"'Methods&Limits'!E83","v":"EN-ISO 12185"},{"$f":"'Methods&Limits'!F83","v":2024},{"$f":"'Methods&Limits'!G83","v":0.50847457627110937},{"$f":"'Methods&Limits'!H83","v":0},{"$f":"'Methods&Limits'!I83","v":845.3},{"$f":"IF(E15=\"\",\"\",IF(E15>G44,\"Yes\",\"\"))","v":""}]
[{"$f":"'Methods&Limits'!A84","v":"Distillation -- 95% Point"},{"$f":"'Methods&Limits'!B84","v":"oC"},{"$f":"'Methods&Limits'!E84","v":"EN-ISO 3405"},{"$f":"'Methods&Limits'!F84","v":2019},{"$f":"'Methods&Limits'!G84","v":10},{"$f":"'Methods&Limits'!H84","v":0},{"$f":"'Methods&Limits'!I84","v":365.9},{"$f":"IF(E16=\"\",\"\",IF(E16>G45,\"Yes\",\"\"))","v":""}]
[{"$f":"'Methods&Limits'!A85","v":"Polycyclic aromatic hydrocarbons"},{"$f":"'Methods&Limits'!B85","v":"% (m/m)"},{"$f":"'Methods&Limits'!E85","v":"EN 12916"},{"$f":"'Methods&Limits'!F85","v":2019},{"$f":"'Methods&Limits'!G85","v":1.9},{"$f":"'Methods&Limits'!H85","v":0},{"$f":"'Methods&Limits'!I85","v":9.1210000000000004},{"$f":"IF(E17=\"\",\"\",IF(E17>G46,\"Yes\",\"\"))","v":""}]
[{"$f":"'Methods&Limits'!A86","v":"Sulphur content (sulphur free, from 2005)"},{"$f":"'Methods&Limits'!B86","v":"mg/kg"},{"$f":"'Methods&Limits'!E86","v":"EN-ISO 20846"},{"$f":"'Methods&Limits'!F86","v":2019},{"$f":"'Methods&Limits'!G86","v":2.2000000000000002},{"$f":"'Methods&Limits'!H86","v":0},{"$f":"'Methods&Limits'!I86","v":11.298},{"$f":"IF(E18=\"\",\"\",IF(E18>G47,\"Yes\",\"\"))","v":""}]
[null,null,{"$f":"'Methods&Limits'!E87","v":"EN-ISO 20884"},{"$f":"'Methods&Limits'!F87","v":2019},{"$f":"'Methods&Limits'!G87","v":3.1},{"$f":"'Methods&Limits'!H87","v":0},{"$f":"'Methods&Limits'!I87","v":11.829000000000001},{"$f":"IF(E18=\"\",\"\",IF(E18>G48,\"Yes\",\"\"))","v":""}]
[{"$f":"'Methods&Limits'!A88","v":"FAME Content"},{"$f":"'Methods&Limits'!B88","v":"% V/V"},{"$f":"'Methods&Limits'!E88","v":"EN14078"},{"$f":"'Methods&Limits'!F88","v":2014},{"$f":"'Methods&Limits'!G88","v":0.5},{"$f":"'Methods&Limits'!H88","v":0},{"$f":"'Methods&Limits'!I88","v":10.295},{"$f":"IF(E19=\"\",\"\",IF(E19>G49,\"Yes\",\"\"))","v":""}]

{"sheet":"Diesel (5+6)","index":36,"n_rows":49,"n_cols":18,"rows_kept":49,"cut":false,"hidden":false,"merged":[[2,1,2,3],[2,6,9,16],[3,1,3,3],[4,1,4,3],[5,1,5,3],[6,1,6,3],[7,1,7,3],[30,4,30,13],[10,2,11,10],[10,11,10,14],[10,15,10,16],[11,11,11,12],[11,13,11,14],[11,15,11,16],[23,0,23,3],[24,4,25,13],[26,4,26,13],[27,4,28,13],[29,4,29,13],[46,11,46,12],[33,0,33,13],[38,2,38,8],[38,9,38,12],[39,5,39,6],[39,8,40,8],[39,9,40,9],[39,10,40,10],[39,11,40,12],[41,11,41,12],[42,11,42,12],[43,11,43,12],[44,11,44,12],[45,11,45,12],[47,11,47,12],[48,11,48,12],[49,0,50,0],[49,1,50,1],[50,11,50,12],[49,11,49,12]]}
["Market Fuels used in the Compression Ignition Engines (Diesel)",null,null,null,null,null,null,null,null,null,null,null,null,null,null,null,null,"<-- GO BACK"]
[]
["Country",{"$f":"IF(LEN('Contacts&Annual Summary'!C9) > 1,'Contacts&Annual Summary'!C9,\"\")","v":""},null,null,null,null,"Notes on completing the tables\nThe table structure has been locked to prevent modification - data can be copied and pasted, in bulk into the Reporting Results blue table cells.  Where a white row exists between rows, it will not be possible to paste over white rows and sections should be pasted separately.\n\nColumn H in the Test Methods and Analysis table is set to automatically check whether the numerical values entered in the Reporting Results table exceed maximum or minimum Tolerance Limits.  If any exceedance is detected, please provide details in the columns to the right including the number of samples, location samples were taken from, Values and Details of any action taken to address non-compliant samples.  Compliance information is verified manually and this automated compliance check is not solely relied upon during data analysis.\n\nPlease do not unlock this template - modified templates cannot be processed and may delay reporting."]
["Reporting year",{"$f":"'Contacts&Annual Summary'!C8","v":2023}]
["Period (Summer or Winter)","Full Year"]
["Parent fuel grade","Diesel"]
["National fuel grade",{"$f":"'Diesel (5)'!B7","v":0}]
["The maximum FAME content (% v/v)",{"$f":"MAX('Diesel (5)'!B8:D8,'Diesel (6)'!B8:D8)","v":0}]
["Reporting Results"]
[]
["Parameter","Unit","Analytical and statistical results",null,null,null,null,null,null,null,null,"Limiting value (1)",null,null,null,"Test method"]
[null,null,null,null,null,null,null,null,null,null,null,"National Specifications",null,"According to Directive 2009/30/EC",null,"(more recent versions may also be used)"]
[null,null,"No Samples","Minimum","Maximum","Median","Mean","Standard deviation","No Samples outside 95% tolerance limit","25% of Sample Value","75% of Sample Value","Minimum","Maximum","Minimum","Maximum","Method","Date"]
["Cetane number","--",{"$f":"IF(AND('Diesel (5)'!C14=\"\",'Diesel (6)'!C14=\"\"),\"\",SUM('Diesel (5)'!C14,'Diesel (6)'!C14))","v":0},{"$f":"IF(AND('Diesel (5)'!D14=\"\",'Diesel (6)'!D14=\"\"),\"\",MIN('Diesel (5)'!D14,'Diesel (6)'!D14))","v":0},{"$f":"IF(AND('Diesel (5)'!E14=\"\",'Diesel (6)'!E14=\"\"),\"\",MAX('Diesel (5)'!E14,'Diesel (6)'!E14))","v":0},0,0,0,{"$f":"IF(AND('Diesel (5)'!I14=\"\",'Diesel (6)'!I14=\"\"),\"\",SUM('Diesel (5)'!I14,'Diesel (6)'!I14))","v":0},0,0,null,null,51,"--","EN-ISO 5165",1998]
["Density at 15 oC (2)","kg/m3",{"$f":"IF(AND('Diesel (5)'!C15=\"\",'Diesel (6)'!C15=\"\"),\"\",SUM('Diesel (5)'!C15,'Diesel (6)'!C15))","v":0},{"$f":"IF(AND('Diesel (5)'!D15=\"\",'Diesel (6)'!D15=\"\"),\"\",MIN('Diesel (5)'!D15,'Diesel (6)'!D15))","v":0},{"$f":"IF(AND('Diesel (5)'!E15=\"\",'Diesel (6)'!E15=\"\"),\"\",MAX('Diesel (5)'!E15,'Diesel (6)'!E15))","v":0},0,0,0,{"$f":"IF(AND('Diesel (5)'!I15=\"\",'Diesel (6)'!I15=\"\"),\"\",SUM('Diesel (5)'!I15,'Diesel (6)'!I15))","v":0},0,0,null,null,null,845,"EN-ISO 3675",1998]
["Distillation -- 95-%-Point","oC",{"$f":"IF(AND('Diesel (5)'!C16=\"\",'Diesel (6)'!C16=\"\"),\"\",SUM('Diesel (5)'!C16,'Diesel (6)'!C16))","v":0},{"$f":"IF(AND('Diesel (5)'!D16=\"\",'Diesel (6)'!D16=\"\"),\"\",MIN('Diesel (5)'!D16,'Diesel (6)'!D16))","v":0},{"$f":"IF(AND('Diesel (5)'!E16=\"\",'Diesel (6)'!E16=\"\"),\"\",MAX('Diesel (5)'!E16,'Diesel (6)'!E16))","v":0},0,0,0,{"$f":"IF(AND('Diesel (5)'!I16=\"\",'Diesel (6)'!I16=\"\"),\"\",SUM('Diesel (5)'!I16,'Diesel (6)'!I16))","v":0},0,0,null,null,null,360,"EN-ISO 3405",2000]
["Polycyclic aromatic hydrocarbons (PAH) (3)","% (m/m)",{"$f":"IF(AND('Diesel (5)'!C17=\"\",'Diesel (6)'!C17=\"\"),\"\",SUM('Diesel (5)'!C17,'Diesel (6)'!C17))","v":0},{"$f":"IF(AND('Diesel (5)'!D17=\"\",'Diesel (6)'!D17=\"\"),\"\",MIN('Diesel (5)'!D17,'Diesel (6)'!D17))","v":0},{"$f":"IF(AND('Diesel (5)'!E17=\"\",'Diesel (6)'!E17=\"\"),\"\",MAX('Diesel (5)'!E17,'Diesel (6)'!E17))","v":0},0,0,0,{"$f":"IF(AND('Diesel (5)'!I17=\"\",'Diesel (6)'!I17=\"\"),\"\",SUM('Diesel (5)'!I17,'Diesel (6)'!I17))","v":0},0,0,null,null,null,8,"EN 12916",2006]
["Sulphur content","mg/kg",{"$f":"IF(AND('Diesel (5)'!C18=\"\",'Diesel (6)'!C18=\"\"),\"\",SUM('Diesel (5)'!C18,'Diesel (6)'!C18))","v":0},{"$f":"IF(AND('Diesel (5)'!D18=\"\",'Diesel (6)'!D18=\"\"),\"\",MIN('Diesel (5)'!D18,'Diesel (6)'!D18))","v":0},{"$f":"IF(AND('Diesel (5)'!E18=\"\",'Diesel (6)'!E18=\"\"),\"\",MAX('Diesel (5)'!E18,'Diesel (6)'!E18))","v":0},0,0,0,{"$f":"IF(AND('Diesel (5)'!I18=\"\",'Diesel (6)'!I18=\"\"),\"\",SUM('Diesel (5)'!I18,'Diesel (6)'!I18))","v":0},0,0,null,null,null,10,"EN ISO 20846\nEN ISO 20884",2004]
["FAME Content","% v/v",{"$f":"IF(AND('Diesel (5)'!C19=\"\",'Diesel (6)'!C19=\"\"),\"\",SUM('Diesel (5)'!C19,'Diesel (6)'!C19))","v":0},{"$f":"IF(AND('Diesel (5)'!D19=\"\",'Diesel (6)'!D19=\"\"),\"\",MIN('Diesel (5)'!D19,'Diesel (6)'!D19))","v":0},{"$f":"IF(AND('Diesel (5)'!E19=\"\",'Diesel (6)'!E19=\"\"),\"\",MAX('Diesel (5)'!E19,'Diesel (6)'!E19))","v":0},0,0,0,{"$f":"IF(AND('Diesel (5)'!I19=\"\",'Diesel (6)'!I19=\"\"),\"\",SUM('Diesel (5)'!I19,'Diesel (6)'!I19))","v":0},0,0,null,null,null,"7 (4)","EN 14078",2009]
[]
[]
["Sampling Frequency"]
[]
["Number of samples in month"]
["January",{"$f":"'Diesel (5)'!B25+'Diesel (6)'!B25","v":0},"July",{"$f":"'Diesel (5)'!D25+'Diesel (6)'!D25","v":0},"(1) The limiting values are \"true values\" and were established according to the procedures for limit setting in EN 228:2008.  The results of individual measurements shall be interpreted following the criteria described in EN 228:2008."]
["February",{"$f":"'Diesel (5)'!B26+'Diesel (6)'!B26","v":0},"August",{"$f":"'Diesel (5)'!D26+'Diesel (6)'!D26","v":0}]
["March",{"$f":"'Diesel (5)'!B27+'Diesel (6)'!B27","v":0},"September",{"$f":"'Diesel (5)'!D27+'Diesel (6)'!D27","v":0},"(2) In cases of dispute EN ISO 3675: 1998 shall be used"]
["April",{"$f":"'Diesel (5)'!B28+'Diesel (6)'!B28","v":0},"October",{"$f":"'Diesel (5)'!D28+'Diesel (6)'!D28","v":0},"(3) Polycyclic aromatic hydrocarbons are defined as the total aromatic hydrocarbon content less than the mono-aromatic hydrocarbons content, both as determined by EN 12916"]
["May",{"$f":"'Diesel (5)'!B29+'Diesel (6)'!B29","v":0},"November",{"$f":"'Diesel (5)'!D29+'Diesel (6)'!D29","v":0}]
["June",{"$f":"'Diesel (5)'!B30+'Diesel (6)'!B30","v":0},"December",{"$f":"'Diesel (5)'!D30+'Diesel (6)'!D30","v":0},"(4) FAME shall comply with EN 14078"]
[null,null,"Full Year Total",{"$f":"SUM(B25:B30,D25:D30)","v":0},"(5) Only for countries which are measuring MMT in Diesel"]
[]
["Other notes (optional):"]
[]
[]
[]
["Test Methods and Analysis",null,null,null,null,null,null,null,null,"Only if not provided in Summer and Winter sheets"]
[]
["Parameter","Unit","Test specified in 98/70/EC or EN590: 590 (more recent versions may also be used)",null,null,null,null,null,null,"Notes on exceedences"]
[null,null,"Method","Date","Reproducability, R","Tolerance limits",null,null,null,"Sample location \n(S,T or R)","Values","Details/action taken"]
[null,null,null,null,null,"Minimum","Maximum","Exceeded?"]
[{"$f":"'Methods&Limits'!A81","v":"Cetane number"},{"$f":"'Methods&Limits'!B81","v":"--"},{"$f":"'Methods&Limits'!E81","v":"EN-ISO 5165"},{"$f":"'Methods&Limits'!F81","v":2020},{"$f":"'Methods&Limits'!G81","v":4.3},{"$f":"'Methods&Limits'!H81","v":48.463000000000001},null,{"$f":"IF(D14=\"\",\"\",IF(D14<F42,\"Yes\",\"\"))","v":"Yes"}]
[{"$f":"'Methods&Limits'!A82","v":"Density at 15 oC"},{"$f":"'Methods&Limits'!B82","v":"kg/m3"},{"$f":"'Methods&Limits'!E82","v":"EN-ISO 3675"},{"$f":"'Methods&Limits'!F82","v":2022},{"$f":"'Methods&Limits'!G82","v":1.2},{"$f":"'Methods&Limits'!H82","v":0},{"$f":"'Methods&Limits'!I82","v":845.70799999999997},{"$f":"IF(E15=\"\",\"\",IF(E15>G43,\"Yes\",\"\"))","v":""}]
[null,null,{"$f":"'Methods&Limits'!E83","v":"EN-ISO 12185"},{"$f":"'Methods&Limits'!F83","v":2024},{"$f":"'Methods&Limits'!G83","v":0.50847457627110937},{"$f":"'Methods&Limits'!H83","v":0},{"$f":"'Methods&Limits'!I83","v":845.3},{"$f":"IF(E15=\"\",\"\",IF(E15>G44,\"Yes\",\"\"))","v":""}]
[{"$f":"'Methods&Limits'!A84","v":"Distillation -- 95% Point"},{"$f":"'Methods&Limits'!B84","v":"oC"},{"$f":"'Methods&Limits'!E84","v":"EN-ISO 3405"},{"$f":"'Methods&Limits'!F84","v":2019},{"$f":"'Methods&Limits'!G84","v":10},{"$f":"'Methods&Limits'!H84","v":0},{"$f":"'Methods&Limits'!I84","v":365.9},{"$f":"IF(E16=\"\",\"\",IF(E16>G45,\"Yes\",\"\"))","v":""}]
[{"$f":"'Methods&Limits'!A85","v":"Polycyclic aromatic hydrocarbons"},{"$f":"'Methods&Limits'!B85","v":"% (m/m)"},{"$f":"'Methods&Limits'!E85","v":"EN 12916"},{"$f":"'Methods&Limits'!F85","v":2019},{"$f":"'Methods&Limits'!G85","v":1.9},{"$f":"'Methods&Limits'!H85","v":0},{"$f":"'Methods&Limits'!I85","v":9.1210000000000004},{"$f":"IF(E17=\"\",\"\",IF(E17>G46,\"Yes\",\"\"))","v":""}]
[{"$f":"'Methods&Limits'!A86","v":"Sulphur content (sulphur free, from 2005)"},{"$f":"'Methods&Limits'!B86","v":"mg/kg"},{"$f":"'Methods&Limits'!E86","v":"EN-ISO 20846"},{"$f":"'Methods&Limits'!F86","v":2019},{"$f":"'Methods&Limits'!G86","v":2.2000000000000002},{"$f":"'Methods&Limits'!H86","v":0},{"$f":"'Methods&Limits'!I86","v":11.298},{"$f":"IF(E18=\"\",\"\",IF(E18>G47,\"Yes\",\"\"))","v":""}]
[null,null,{"$f":"'Methods&Limits'!E87","v":"EN-ISO 20884"},{"$f":"'Methods&Limits'!F87","v":2019},{"$f":"'Methods&Limits'!G87","v":3.1},{"$f":"'Methods&Limits'!H87","v":0},{"$f":"'Methods&Limits'!I87","v":11.829000000000001},{"$f":"IF(E18=\"\",\"\",IF(E18>G48,\"Yes\",\"\"))","v":""}]
[{"$f":"'Methods&Limits'!A88","v":"FAME Content"},{"$f":"'Methods&Limits'!B88","v":"% V/V"},{"$f":"'Methods&Limits'!E88","v":"EN14078"},{"$f":"'Methods&Limits'!F88","v":2014},{"$f":"'Methods&Limits'!G88","v":0.5},{"$f":"'Methods&Limits'!H88","v":0},{"$f":"'Methods&Limits'!I88","v":10.295},{"$f":"IF(E19=\"\",\"\",IF(E19>G49,\"Yes\",\"\"))","v":""}]

{"sheet":"Diesel (7)","index":37,"n_rows":49,"n_cols":18,"rows_kept":49,"cut":false,"hidden":false,"merged":[[2,1,2,3],[2,6,9,16],[3,1,3,3],[4,1,4,3],[5,1,5,3],[6,1,6,3],[7,1,7,3],[30,4,30,13],[10,2,11,10],[10,11,10,14],[10,15,10,16],[11,11,11,12],[11,13,11,14],[11,15,11,16],[23,0,23,3],[24,4,25,13],[26,4,26,13],[27,4,28,13],[29,4,29,13],[46,11,46,12],[33,0,33,13],[38,2,38,8],[38,9,38,12],[39,5,39,6],[39,8,40,8],[39,9,40,9],[39,10,40,10],[39,11,40,12],[41,11,41,12],[42,11,42,12],[43,11,43,12],[44,11,44,12],[45,11,45,12],[47,11,47,12],[48,11,48,12],[49,0,50,0],[49,1,50,1],[50,11,50,12],[49,11,49,12]]}
["Market Fuels used in the Compression Ignition Engines (Diesel)",null,null,null,null,null,null,null,null,null,null,null,null,null,null,null,null,"<-- GO BACK"]
[]
["Country",{"$f":"IF(LEN('Contacts&Annual Summary'!C9) > 1,'Contacts&Annual Summary'!C9,\"\")","v":""},null,null,null,null,"Notes on completing the tables\nThe table structure has been locked to prevent modification - data can be copied and pasted, in bulk into the Reporting Results blue table cells.  Where a white row exists between rows, it will not be possible to paste over white rows and sections should be pasted separately.\n\nColumn H in the Test Methods and Analysis table is set to automatically check whether the numerical values entered in the Reporting Results table exceed maximum or minimum Tolerance Limits.  If any exceedance is detected, please provide details in the columns to the right including the number of samples, location samples were taken from, Values and Details of any action taken to address non-compliant samples.  Compliance information is verified manually and this automated compliance check is not solely relied upon during data analysis.\n\nPlease do not unlock this template - modified templates cannot be processed and may delay reporting."]
["Reporting year",{"$f":"'Contacts&Annual Summary'!C8","v":2023}]
["Period (Summer or Winter)","Summer"]
["Parent fuel grade","Diesel"]
["National fuel grade"]
["The maximum FAME content (% v/v)",0]
["Reporting Results"]
[]
["Parameter","Unit","Analytical and statistical results",null,null,null,null,null,null,null,null,"Limiting value (1)",null,null,null,"Test method"]
[null,null,null,null,null,null,null,null,null,null,null,"National Specifications",null,"According to Directive 2009/30/EC",null,"(more recent versions may also be used)"]
[null,null,"No Samples","Minimum","Maximum","Median","Mean","Standard deviation","No Samples outside 95% tolerance limit","25% of Sample Value","75% of Sample Value","Minimum","Maximum","Minimum","Maximum","Method","Date"]
["Cetane number","--",0,0,0,0,0,0,0,0,0,null,null,51,"--","EN-ISO 5165",1998]
["Density at 15 oC (2)","kg/m3",0,0,0,0,0,0,0,0,0,null,null,null,845,"EN-ISO 3675",1998]
["Distillation -- 95-%-Point","oC",0,0,0,0,0,0,0,0,0,null,null,null,360,"EN-ISO 3405",2000]
["Polycyclic aromatic hydrocarbons (PAH) (3)","% (m/m)",0,0,0,0,0,0,0,0,0,null,null,null,8,"EN 12916",2006]
["Sulphur content","mg/kg",0,0,0,0,0,0,0,0,0,null,null,null,10,"EN ISO 20846\nEN ISO 20884",2004]
["FAME Content","% v/v",0,0,0,0,0,0,0,0,0,null,null,null,"7 (4)","EN 14078",2009]
[]
[]
["Sampling Frequency"]
[]
["Number of samples in month"]
["January",0,"July",0,"(1) The limiting values are \"true values\" and were established according to the procedures for limit setting in EN 228:2008.  The results of individual measurements shall be interpreted following the criteria described in EN 228:2008."]
["February",0,"August",0]
["March",0,"September",0,"(2) In cases of dispute EN ISO 3675: 1998 shall be used"]
["April",0,"October",0,"(3) Polycyclic aromatic hydrocarbons are defined as the total aromatic hydrocarbon content less than the mono-aromatic hydrocarbons content, both as determined by EN 12916"]
["May",0,"November",0]
["June",0,"December",0,"(4) FAME shall comply with EN 14078"]
[null,null,"Summer Months Total",{"$f":"SUM(B25:B30,D25:D30)","v":0},"(5) Only for countries which are measuring MMT in Diesel"]
[]
["Other notes (optional):"]
[]
[]
[]
["Test Methods and Analysis"]
[]
["Parameter","Unit","Test specified in 98/70/EC or EN590: 590 (more recent versions may also be used)",null,null,null,null,null,null,"Notes on exceedences"]
[null,null,"Method","Date","Reproducability, R","Tolerance limits",null,null,null,"Sample location \n(S,T or R)","Values","Details/action taken"]
[null,null,null,null,null,"Minimum","Maximum","Exceeded?"]
[{"$f":"'Methods&Limits'!A81","v":"Cetane number"},{"$f":"'Methods&Limits'!B81","v":"--"},{"$f":"'Methods&Limits'!E81","v":"EN-ISO 5165"},{"$f":"'Methods&Limits'!F81","v":2020},{"$f":"'Methods&Limits'!G81","v":4.3},{"$f":"'Methods&Limits'!H81","v":48.463000000000001},null,{"$f":"IF(D14=\"\",\"\",IF(D14<F42,\"Yes\",\"\"))","v":"Yes"}]
[{"$f":"'Methods&Limits'!A82","v":"Density at 15 oC"},{"$f":"'Methods&Limits'!B82","v":"kg/m3"},{"$f":"'Methods&Limits'!E82","v":"EN-ISO 3675"},{"$f":"'Methods&Limits'!F82","v":2022},{"$f":"'Methods&Limits'!G82","v":1.2},{"$f":"'Methods&Limits'!H82","v":0},{"$f":"'Methods&Limits'!I82","v":845.70799999999997},{"$f":"IF(E15=\"\",\"\",IF(E15>G43,\"Yes\",\"\"))","v":""}]
[null,null,{"$f":"'Methods&Limits'!E83","v":"EN-ISO 12185"},{"$f":"'Methods&Limits'!F83","v":2024},{"$f":"'Methods&Limits'!G83","v":0.50847457627110937},{"$f":"'Methods&Limits'!H83","v":0},{"$f":"'Methods&Limits'!I83","v":845.3},{"$f":"IF(E15=\"\",\"\",IF(E15>G44,\"Yes\",\"\"))","v":""}]
[{"$f":"'Methods&Limits'!A84","v":"Distillation -- 95% Point"},{"$f":"'Methods&Limits'!B84","v":"oC"},{"$f":"'Methods&Limits'!E84","v":"EN-ISO 3405"},{"$f":"'Methods&Limits'!F84","v":2019},{"$f":"'Methods&Limits'!G84","v":10},{"$f":"'Methods&Limits'!H84","v":0},{"$f":"'Methods&Limits'!I84","v":365.9},{"$f":"IF(E16=\"\",\"\",IF(E16>G45,\"Yes\",\"\"))","v":""}]
[{"$f":"'Methods&Limits'!A85","v":"Polycyclic aromatic hydrocarbons"},{"$f":"'Methods&Limits'!B85","v":"% (m/m)"},{"$f":"'Methods&Limits'!E85","v":"EN 12916"},{"$f":"'Methods&Limits'!F85","v":2019},{"$f":"'Methods&Limits'!G85","v":1.9},{"$f":"'Methods&Limits'!H85","v":0},{"$f":"'Methods&Limits'!I85","v":9.1210000000000004},{"$f":"IF(E17=\"\",\"\",IF(E17>G46,\"Yes\",\"\"))","v":""}]
[{"$f":"'Methods&Limits'!A86","v":"Sulphur content (sulphur free, from 2005)"},{"$f":"'Methods&Limits'!B86","v":"mg/kg"},{"$f":"'Methods&Limits'!E86","v":"EN-ISO 20846"},{"$f":"'Methods&Limits'!F86","v":2019},{"$f":"'Methods&Limits'!G86","v":2.2000000000000002},{"$f":"'Methods&Limits'!H86","v":0},{"$f":"'Methods&Limits'!I86","v":11.298},{"$f":"IF(E18=\"\",\"\",IF(E18>G47,\"Yes\",\"\"))","v":""}]
[null,null,{"$f":"'Methods&Limits'!E87","v":"EN-ISO 20884"},{"$f":"'Methods&Limits'!F87","v":2019},{"$f":"'Methods&Limits'!G87","v":3.1},{"$f":"'Methods&Limits'!H87","v":0},{"$f":"'Methods&Limits'!I87","v":11.829000000000001},{"$f":"IF(E18=\"\",\"\",IF(E18>G48,\"Yes\",\"\"))","v":""}]
[{"$f":"'Methods&Limits'!A88","v":"FAME Content"},{"$f":"'Methods&Limits'!B88","v":"% V/V"},{"$f":"'Methods&Limits'!E88","v":"EN14078"},{"$f":"'Methods&Limits'!F88","v":2014},{"$f":"'Methods&Limits'!G88","v":0.5},{"$f":"'Methods&Limits'!H88","v":0},{"$f":"'Methods&Limits'!I88","v":10.295},{"$f":"IF(E19=\"\",\"\",IF(E19>G49,\"Yes\",\"\"))","v":""}]

{"sheet":"Diesel (8)","index":38,"n_rows":49,"n_cols":18,"rows_kept":49,"cut":false,"hidden":false,"merged":[[2,1,2,3],[2,6,9,16],[3,1,3,3],[4,1,4,3],[5,1,5,3],[6,1,6,3],[7,1,7,3],[30,4,30,13],[10,2,11,10],[10,11,10,14],[10,15,10,16],[11,11,11,12],[11,13,11,14],[11,15,11,16],[23,0,23,3],[24,4,25,13],[26,4,26,13],[27,4,28,13],[29,4,29,13],[46,11,46,12],[33,0,33,13],[38,2,38,8],[38,9,38,12],[39,5,39,6],[39,8,40,8],[39,9,40,9],[39,10,40,10],[39,11,40,12],[41,11,41,12],[42,11,42,12],[43,11,43,12],[44,11,44,12],[45,11,45,12],[47,11,47,12],[48,11,48,12],[49,0,50,0],[49,1,50,1],[50,11,50,12],[49,11,49,12]]}
["Market Fuels used in the Compression Ignition Engines (Diesel)",null,null,null,null,null,null,null,null,null,null,null,null,null,null,null,null,"<-- GO BACK"]
[]
["Country",{"$f":"IF(LEN('Contacts&Annual Summary'!C9) > 1,'Contacts&Annual Summary'!C9,\"\")","v":""},null,null,null,null,"Notes on completing the tables\nThe table structure has been locked to prevent modification - data can be copied and pasted, in bulk into the Reporting Results blue table cells.  Where a white row exists between rows, it will not be possible to paste over white rows and sections should be pasted separately.\n\nColumn H in the Test Methods and Analysis table is set to automatically check whether the numerical values entered in the Reporting Results table exceed maximum or minimum Tolerance Limits.  If any exceedance is detected, please provide details in the columns to the right including the number of samples, location samples were taken from, Values and Details of any action taken to address non-compliant samples.  Compliance information is verified manually and this automated compliance check is not solely relied upon during data analysis.\n\nPlease do not unlock this template - modified templates cannot be processed and may delay reporting."]
["Reporting year",{"$f":"'Contacts&Annual Summary'!C8","v":2023}]
["Period (Summer or Winter)","Winter"]
["Parent fuel grade","Diesel"]
["National fuel grade",{"$f":"'Diesel (7)'!B7","v":0}]
["The maximum FAME content (% v/v)",0]
["Reporting Results"]
[]
["Parameter","Unit","Analytical and statistical results",null,null,null,null,null,null,null,null,"Limiting value (1)",null,null,null,"Test method"]
[null,null,null,null,null,null,null,null,null,null,null,"National Specifications",null,"According to Directive 2009/30/EC",null,"(more recent versions may also be used)"]
[null,null,"No Samples","Minimum","Maximum","Median","Mean","Standard deviation","No Samples outside 95% tolerance limit","25% of Sample Value","75% of Sample Value","Minimum","Maximum","Minimum","Maximum","Method","Date"]
["Cetane number","--",0,0,0,0,0,0,0,0,0,null,null,51,"--","EN-ISO 5165",1998]
["Density at 15 oC (2)","kg/m3",0,0,0,0,0,0,0,0,0,null,null,null,845,"EN-ISO 3675",1998]
["Distillation -- 95-%-Point","oC",0,0,0,0,0,0,0,0,0,null,null,null,360,"EN-ISO 3405",2000]
["Polycyclic aromatic hydrocarbons (PAH) (3)","% (m/m)",0,0,0,0,0,0,0,0,0,null,null,null,8,"EN 12916",2006]
["Sulphur content","mg/kg",0,0,0,0,0,0,0,0,0,null,null,null,10,"EN ISO 20846\nEN ISO 20884",2004]
["FAME Content","% v/v",0,0,0,0,0,0,0,0,0,null,null,null,"7 (4)","EN 14078",2009]
[]
[]
["Sampling Frequency"]
[]
["Number of samples in month"]
["January",0,"July",0,"(1) The limiting values are \"true values\" and were established according to the procedures for limit setting in EN 228:2008.  The results of individual measurements shall be interpreted following the criteria described in EN 228:2008."]
["February",0,"August",0]
["March",0,"September",0,"(2) In cases of dispute EN ISO 3675: 1998 shall be used"]
["April",0,"October",0,"(3) Polycyclic aromatic hydrocarbons are defined as the total aromatic hydrocarbon content less than the mono-aromatic hydrocarbons content, both as determined by EN 12916"]
["May",0,"November",0]
["June",0,"December",0,"(4) FAME shall comply with EN 14078"]
[null,null,"Winter Months Total",{"$f":"SUM(B25:B30,D25:D30)","v":0},"(5) Only for countries which are measuring MMT in Diesel"]
[]
["Other notes (optional):"]
[]
[]
[]
["Test Methods and Analysis"]
[]
["Parameter","Unit","Test specified in 98/70/EC or EN590: 590 (more recent versions may also be used)",null,null,null,null,null,null,"Notes on exceedences"]
[null,null,"Method","Date","Reproducability, R","Tolerance limits",null,null,null,"Sample location \n(S,T or R)","Values","Details/action taken"]
[null,null,null,null,null,"Minimum","Maximum","Exceeded?"]
[{"$f":"'Methods&Limits'!A81","v":"Cetane number"},{"$f":"'Methods&Limits'!B81","v":"--"},{"$f":"'Methods&Limits'!E81","v":"EN-ISO 5165"},{"$f":"'Methods&Limits'!F81","v":2020},{"$f":"'Methods&Limits'!G81","v":4.3},{"$f":"'Methods&Limits'!H81","v":48.463000000000001},null,{"$f":"IF(D14=\"\",\"\",IF(D14<F42,\"Yes\",\"\"))","v":"Yes"}]
[{"$f":"'Methods&Limits'!A82","v":"Density at 15 oC"},{"$f":"'Methods&Limits'!B82","v":"kg/m3"},{"$f":"'Methods&Limits'!E82","v":"EN-ISO 3675"},{"$f":"'Methods&Limits'!F82","v":2022},{"$f":"'Methods&Limits'!G82","v":1.2},{"$f":"'Methods&Limits'!H82","v":0},{"$f":"'Methods&Limits'!I82","v":845.70799999999997},{"$f":"IF(E15=\"\",\"\",IF(E15>G43,\"Yes\",\"\"))","v":""}]
[null,null,{"$f":"'Methods&Limits'!E83","v":"EN-ISO 12185"},{"$f":"'Methods&Limits'!F83","v":2024},{"$f":"'Methods&Limits'!G83","v":0.50847457627110937},{"$f":"'Methods&Limits'!H83","v":0},{"$f":"'Methods&Limits'!I83","v":845.3},{"$f":"IF(E15=\"\",\"\",IF(E15>G44,\"Yes\",\"\"))","v":""}]
[{"$f":"'Methods&Limits'!A84","v":"Distillation -- 95% Point"},{"$f":"'Methods&Limits'!B84","v":"oC"},{"$f":"'Methods&Limits'!E84","v":"EN-ISO 3405"},{"$f":"'Methods&Limits'!F84","v":2019},{"$f":"'Methods&Limits'!G84","v":10},{"$f":"'Methods&Limits'!H84","v":0},{"$f":"'Methods&Limits'!I84","v":365.9},{"$f":"IF(E16=\"\",\"\",IF(E16>G45,\"Yes\",\"\"))","v":""}]
[{"$f":"'Methods&Limits'!A85","v":"Polycyclic aromatic hydrocarbons"},{"$f":"'Methods&Limits'!B85","v":"% (m/m)"},{"$f":"'Methods&Limits'!E85","v":"EN 12916"},{"$f":"'Methods&Limits'!F85","v":2019},{"$f":"'Methods&Limits'!G85","v":1.9},{"$f":"'Methods&Limits'!H85","v":0},{"$f":"'Methods&Limits'!I85","v":9.1210000000000004},{"$f":"IF(E17=\"\",\"\",IF(E17>G46,\"Yes\",\"\"))","v":""}]
[{"$f":"'Methods&Limits'!A86","v":"Sulphur content (sulphur free, from 2005)"},{"$f":"'Methods&Limits'!B86","v":"mg/kg"},{"$f":"'Methods&Limits'!E86","v":"EN-ISO 20846"},{"$f":"'Methods&Limits'!F86","v":2019},{"$f":"'Methods&Limits'!G86","v":2.2000000000000002},{"$f":"'Methods&Limits'!H86","v":0},{"$f":"'Methods&Limits'!I86","v":11.298},{"$f":"IF(E18=\"\",\"\",IF(E18>G47,\"Yes\",\"\"))","v":""}]
[null,null,{"$f":"'Methods&Limits'!E87","v":"EN-ISO 20884"},{"$f":"'Methods&Limits'!F87","v":2019},{"$f":"'Methods&Limits'!G87","v":3.1},{"$f":"'Methods&Limits'!H87","v":0},{"$f":"'Methods&Limits'!I87","v":11.829000000000001},{"$f":"IF(E18=\"\",\"\",IF(E18>G48,\"Yes\",\"\"))","v":""}]
[{"$f":"'Methods&Limits'!A88","v":"FAME Content"},{"$f":"'Methods&Limits'!B88","v":"% V/V"},{"$f":"'Methods&Limits'!E88","v":"EN14078"},{"$f":"'Methods&Limits'!F88","v":2014},{"$f":"'Methods&Limits'!G88","v":0.5},{"$f":"'Methods&Limits'!H88","v":0},{"$f":"'Methods&Limits'!I88","v":10.295},{"$f":"IF(E19=\"\",\"\",IF(E19>G49,\"Yes\",\"\"))","v":""}]

{"sheet":"Diesel (7+8)","index":39,"n_rows":49,"n_cols":18,"rows_kept":49,"cut":false,"hidden":false,"merged":[[2,1,2,3],[2,6,9,16],[3,1,3,3],[4,1,4,3],[5,1,5,3],[6,1,6,3],[7,1,7,3],[30,4,30,13],[10,2,11,10],[10,11,10,14],[10,15,10,16],[11,11,11,12],[11,13,11,14],[11,15,11,16],[23,0,23,3],[24,4,25,13],[26,4,26,13],[27,4,28,13],[29,4,29,13],[46,11,46,12],[33,0,33,13],[38,2,38,8],[38,9,38,12],[39,5,39,6],[39,8,40,8],[39,9,40,9],[39,10,40,10],[39,11,40,12],[41,11,41,12],[42,11,42,12],[43,11,43,12],[44,11,44,12],[45,11,45,12],[47,11,47,12],[48,11,48,12],[49,0,50,0],[49,1,50,1],[50,11,50,12],[49,11,49,12]]}
["Market Fuels used in the Compression Ignition Engines (Diesel)",null,null,null,null,null,null,null,null,null,null,null,null,null,null,null,null,"<-- GO BACK"]
[]
["Country",{"$f":"IF(LEN('Contacts&Annual Summary'!C9) > 1,'Contacts&Annual Summary'!C9,\"\")","v":""},null,null,null,null,"Notes on completing the tables\nThe table structure has been locked to prevent modification - data can be copied and pasted, in bulk into the Reporting Results blue table cells.  Where a white row exists between rows, it will not be possible to paste over white rows and sections should be pasted separately.\n\nColumn H in the Test Methods and Analysis table is set to automatically check whether the numerical values entered in the Reporting Results table exceed maximum or minimum Tolerance Limits.  If any exceedance is detected, please provide details in the columns to the right including the number of samples, location samples were taken from, Values and Details of any action taken to address non-compliant samples.  Compliance information is verified manually and this automated compliance check is not solely relied upon during data analysis.\n\nPlease do not unlock this template - modified templates cannot be processed and may delay reporting."]
["Reporting year",{"$f":"'Contacts&Annual Summary'!C8","v":2023}]
["Period (Summer or Winter)","Full Year"]
["Parent fuel grade","Diesel"]
["National fuel grade",{"$f":"'Diesel (7)'!B7","v":0}]
["The maximum FAME content (% v/v)",{"$f":"MAX('Diesel (7)'!B8:D8,'Diesel (8)'!B8:D8)","v":0}]
["Reporting Results"]
[]
["Parameter","Unit","Analytical and statistical results",null,null,null,null,null,null,null,null,"Limiting value (1)",null,null,null,"Test method"]
[null,null,null,null,null,null,null,null,null,null,null,"National Specifications",null,"According to Directive 2009/30/EC",null,"(more recent versions may also be used)"]
[null,null,"No Samples","Minimum","Maximum","Median","Mean","Standard deviation","No Samples outside 95% tolerance limit","25% of Sample Value","75% of Sample Value","Minimum","Maximum","Minimum","Maximum","Method","Date"]
["Cetane number","--",{"$f":"IF(AND('Diesel (7)'!C14=\"\",'Diesel (8)'!C14=\"\"),\"\",SUM('Diesel (7)'!C14,'Diesel (8)'!C14))","v":0},{"$f":"IF(AND('Diesel (7)'!D14=\"\",'Diesel (8)'!D14=\"\"),\"\",MIN('Diesel (7)'!D14,'Diesel (8)'!D14))","v":0},{"$f":"IF(AND('Diesel (7)'!E14=\"\",'Diesel (8)'!E14=\"\"),\"\",MAX('Diesel (7)'!E14,'Diesel (8)'!E14))","v":0},0,0,0,{"$f":"IF(AND('Diesel (7)'!I14=\"\",'Diesel (8)'!I14=\"\"),\"\",SUM('Diesel (7)'!I14,'Diesel (8)'!I14))","v":0},0,0,null,null,51,"--","EN-ISO 5165",1998]
["Density at 15 oC (2)","kg/m3",{"$f":"IF(AND('Diesel (7)'!C15=\"\",'Diesel (8)'!C15=\"\"),\"\",SUM('Diesel (7)'!C15,'Diesel (8)'!C15))","v":0},{"$f":"IF(AND('Diesel (7)'!D15=\"\",'Diesel (8)'!D15=\"\"),\"\",MIN('Diesel (7)'!D15,'Diesel (8)'!D15))","v":0},{"$f":"IF(AND('Diesel (7)'!E15=\"\",'Diesel (8)'!E15=\"\"),\"\",MAX('Diesel (7)'!E15,'Diesel (8)'!E15))","v":0},0,0,0,{"$f":"IF(AND('Diesel (7)'!I15=\"\",'Diesel (8)'!I15=\"\"),\"\",SUM('Diesel (7)'!I15,'Diesel (8)'!I15))","v":0},0,0,null,null,null,845,"EN-ISO 3675",1998]
["Distillation -- 95-%-Point","oC",{"$f":"IF(AND('Diesel (7)'!C16=\"\",'Diesel (8)'!C16=\"\"),\"\",SUM('Diesel (7)'!C16,'Diesel (8)'!C16))","v":0},{"$f":"IF(AND('Diesel (7)'!D16=\"\",'Diesel (8)'!D16=\"\"),\"\",MIN('Diesel (7)'!D16,'Diesel (8)'!D16))","v":0},{"$f":"IF(AND('Diesel (7)'!E16=\"\",'Diesel (8)'!E16=\"\"),\"\",MAX('Diesel (7)'!E16,'Diesel (8)'!E16))","v":0},0,0,0,{"$f":"IF(AND('Diesel (7)'!I16=\"\",'Diesel (8)'!I16=\"\"),\"\",SUM('Diesel (7)'!I16,'Diesel (8)'!I16))","v":0},0,0,null,null,null,360,"EN-ISO 3405",2000]
["Polycyclic aromatic hydrocarbons (PAH) (3)","% (m/m)",{"$f":"IF(AND('Diesel (7)'!C17=\"\",'Diesel (8)'!C17=\"\"),\"\",SUM('Diesel (7)'!C17,'Diesel (8)'!C17))","v":0},{"$f":"IF(AND('Diesel (7)'!D17=\"\",'Diesel (8)'!D17=\"\"),\"\",MIN('Diesel (7)'!D17,'Diesel (8)'!D17))","v":0},{"$f":"IF(AND('Diesel (7)'!E17=\"\",'Diesel (8)'!E17=\"\"),\"\",MAX('Diesel (7)'!E17,'Diesel (8)'!E17))","v":0},0,0,0,{"$f":"IF(AND('Diesel (7)'!I17=\"\",'Diesel (8)'!I17=\"\"),\"\",SUM('Diesel (7)'!I17,'Diesel (8)'!I17))","v":0},0,0,null,null,null,8,"EN 12916",2006]
["Sulphur content","mg/kg",{"$f":"IF(AND('Diesel (7)'!C18=\"\",'Diesel (8)'!C18=\"\"),\"\",SUM('Diesel (7)'!C18,'Diesel (8)'!C18))","v":0},{"$f":"IF(AND('Diesel (7)'!D18=\"\",'Diesel (8)'!D18=\"\"),\"\",MIN('Diesel (7)'!D18,'Diesel (8)'!D18))","v":0},{"$f":"IF(AND('Diesel (7)'!E18=\"\",'Diesel (8)'!E18=\"\"),\"\",MAX('Diesel (7)'!E18,'Diesel (8)'!E18))","v":0},0,0,0,{"$f":"IF(AND('Diesel (7)'!I18=\"\",'Diesel (8)'!I18=\"\"),\"\",SUM('Diesel (7)'!I18,'Diesel (8)'!I18))","v":0},0,0,null,null,null,10,"EN ISO 20846\nEN ISO 20884",2004]
["FAME Content","% v/v",{"$f":"IF(AND('Diesel (7)'!C19=\"\",'Diesel (8)'!C19=\"\"),\"\",SUM('Diesel (7)'!C19,'Diesel (8)'!C19))","v":0},{"$f":"IF(AND('Diesel (7)'!D19=\"\",'Diesel (8)'!D19=\"\"),\"\",MIN('Diesel (7)'!D19,'Diesel (8)'!D19))","v":0},{"$f":"IF(AND('Diesel (7)'!E19=\"\",'Diesel (8)'!E19=\"\"),\"\",MAX('Diesel (7)'!E19,'Diesel (8)'!E19))","v":0},0,0,0,{"$f":"IF(AND('Diesel (7)'!I19=\"\",'Diesel (8)'!I19=\"\"),\"\",SUM('Diesel (7)'!I19,'Diesel (8)'!I19))","v":0},0,0,null,null,null,"7 (4)","EN 14078",2009]
[]
[]
["Sampling Frequency"]
[]
["Number of samples in month"]
["January",{"$f":"'Diesel (7)'!B25+'Diesel (8)'!B25","v":0},"July",{"$f":"'Diesel (7)'!D25+'Diesel (8)'!D25","v":0},"(1) The limiting values are \"true values\" and were established according to the procedures for limit setting in EN 228:2008.  The results of individual measurements shall be interpreted following the criteria described in EN 228:2008."]
["February",{"$f":"'Diesel (7)'!B26+'Diesel (8)'!B26","v":0},"August",{"$f":"'Diesel (7)'!D26+'Diesel (8)'!D26","v":0}]
["March",{"$f":"'Diesel (7)'!B27+'Diesel (8)'!B27","v":0},"September",{"$f":"'Diesel (7)'!D27+'Diesel (8)'!D27","v":0},"(2) In cases of dispute EN ISO 3675: 1998 shall be used"]
["April",{"$f":"'Diesel (7)'!B28+'Diesel (8)'!B28","v":0},"October",{"$f":"'Diesel (7)'!D28+'Diesel (8)'!D28","v":0},"(3) Polycyclic aromatic hydrocarbons are defined as the total aromatic hydrocarbon content less than the mono-aromatic hydrocarbons content, both as determined by EN 12916"]
["May",{"$f":"'Diesel (7)'!B29+'Diesel (8)'!B29","v":0},"November",{"$f":"'Diesel (7)'!D29+'Diesel (8)'!D29","v":0}]
["June",{"$f":"'Diesel (7)'!B30+'Diesel (8)'!B30","v":0},"December",{"$f":"'Diesel (7)'!D30+'Diesel (8)'!D30","v":0},"(4) FAME shall comply with EN 14078"]
[null,null,"Full Year Total",{"$f":"SUM(B25:B30,D25:D30)","v":0},"(5) Only for countries which are measuring MMT in Diesel"]
[]
["Other notes (optional):"]
[]
[]
[]
["Test Methods and Analysis",null,null,null,null,null,null,null,null,"Only if not provided in Summer and Winter sheets"]
[]
["Parameter","Unit","Test specified in 98/70/EC or EN590: 590 (more recent versions may also be used)",null,null,null,null,null,null,"Notes on exceedences"]
[null,null,"Method","Date","Reproducability, R","Tolerance limits",null,null,null,"Sample location \n(S,T or R)","Values","Details/action taken"]
[null,null,null,null,null,"Minimum","Maximum","Exceeded?"]
[{"$f":"'Methods&Limits'!A81","v":"Cetane number"},{"$f":"'Methods&Limits'!B81","v":"--"},{"$f":"'Methods&Limits'!E81","v":"EN-ISO 5165"},{"$f":"'Methods&Limits'!F81","v":2020},{"$f":"'Methods&Limits'!G81","v":4.3},{"$f":"'Methods&Limits'!H81","v":48.463000000000001},null,{"$f":"IF(D14=\"\",\"\",IF(D14<F42,\"Yes\",\"\"))","v":"Yes"}]
[{"$f":"'Methods&Limits'!A82","v":"Density at 15 oC"},{"$f":"'Methods&Limits'!B82","v":"kg/m3"},{"$f":"'Methods&Limits'!E82","v":"EN-ISO 3675"},{"$f":"'Methods&Limits'!F82","v":2022},{"$f":"'Methods&Limits'!G82","v":1.2},{"$f":"'Methods&Limits'!H82","v":0},{"$f":"'Methods&Limits'!I82","v":845.70799999999997},{"$f":"IF(E15=\"\",\"\",IF(E15>G43,\"Yes\",\"\"))","v":""}]
[null,null,{"$f":"'Methods&Limits'!E83","v":"EN-ISO 12185"},{"$f":"'Methods&Limits'!F83","v":2024},{"$f":"'Methods&Limits'!G83","v":0.50847457627110937},{"$f":"'Methods&Limits'!H83","v":0},{"$f":"'Methods&Limits'!I83","v":845.3},{"$f":"IF(E15=\"\",\"\",IF(E15>G44,\"Yes\",\"\"))","v":""}]
[{"$f":"'Methods&Limits'!A84","v":"Distillation -- 95% Point"},{"$f":"'Methods&Limits'!B84","v":"oC"},{"$f":"'Methods&Limits'!E84","v":"EN-ISO 3405"},{"$f":"'Methods&Limits'!F84","v":2019},{"$f":"'Methods&Limits'!G84","v":10},{"$f":"'Methods&Limits'!H84","v":0},{"$f":"'Methods&Limits'!I84","v":365.9},{"$f":"IF(E16=\"\",\"\",IF(E16>G45,\"Yes\",\"\"))","v":""}]
[{"$f":"'Methods&Limits'!A85","v":"Polycyclic aromatic hydrocarbons"},{"$f":"'Methods&Limits'!B85","v":"% (m/m)"},{"$f":"'Methods&Limits'!E85","v":"EN 12916"},{"$f":"'Methods&Limits'!F85","v":2019},{"$f":"'Methods&Limits'!G85","v":1.9},{"$f":"'Methods&Limits'!H85","v":0},{"$f":"'Methods&Limits'!I85","v":9.1210000000000004},{"$f":"IF(E17=\"\",\"\",IF(E17>G46,\"Yes\",\"\"))","v":""}]
[{"$f":"'Methods&Limits'!A86","v":"Sulphur content (sulphur free, from 2005)"},{"$f":"'Methods&Limits'!B86","v":"mg/kg"},{"$f":"'Methods&Limits'!E86","v":"EN-ISO 20846"},{"$f":"'Methods&Limits'!F86","v":2019},{"$f":"'Methods&Limits'!G86","v":2.2000000000000002},{"$f":"'Methods&Limits'!H86","v":0},{"$f":"'Methods&Limits'!I86","v":11.298},{"$f":"IF(E18=\"\",\"\",IF(E18>G47,\"Yes\",\"\"))","v":""}]
[null,null,{"$f":"'Methods&Limits'!E87","v":"EN-ISO 20884"},{"$f":"'Methods&Limits'!F87","v":2019},{"$f":"'Methods&Limits'!G87","v":3.1},{"$f":"'Methods&Limits'!H87","v":0},{"$f":"'Methods&Limits'!I87","v":11.829000000000001},{"$f":"IF(E18=\"\",\"\",IF(E18>G48,\"Yes\",\"\"))","v":""}]
[{"$f":"'Methods&Limits'!A88","v":"FAME Content"},{"$f":"'Methods&Limits'!B88","v":"% V/V"},{"$f":"'Methods&Limits'!E88","v":"EN14078"},{"$f":"'Methods&Limits'!F88","v":2014},{"$f":"'Methods&Limits'!G88","v":0.5},{"$f":"'Methods&Limits'!H88","v":0},{"$f":"'Methods&Limits'!I88","v":10.295},{"$f":"IF(E19=\"\",\"\",IF(E19>G49,\"Yes\",\"\"))","v":""}]

{"sheet":"Diesel (9)","index":40,"n_rows":49,"n_cols":18,"rows_kept":49,"cut":false,"hidden":false,"merged":[[2,1,2,3],[2,6,9,16],[3,1,3,3],[4,1,4,3],[5,1,5,3],[6,1,6,3],[7,1,7,3],[30,4,30,13],[10,2,11,10],[10,11,10,14],[10,15,10,16],[11,11,11,12],[11,13,11,14],[11,15,11,16],[23,0,23,3],[24,4,25,13],[26,4,26,13],[27,4,28,13],[29,4,29,13],[46,11,46,12],[33,0,33,13],[38,2,38,8],[38,9,38,12],[39,5,39,6],[39,8,40,8],[39,9,40,9],[39,10,40,10],[39,11,40,12],[41,11,41,12],[42,11,42,12],[43,11,43,12],[44,11,44,12],[45,11,45,12],[47,11,47,12],[48,11,48,12],[49,0,50,0],[49,1,50,1],[50,11,50,12],[49,11,49,12]]}
["Market Fuels used in the Compression Ignition Engines (Diesel)",null,null,null,null,null,null,null,null,null,null,null,null,null,null,null,null,"<-- GO BACK"]
[]
["Country",{"$f":"IF(LEN('Contacts&Annual Summary'!C9) > 1,'Contacts&Annual Summary'!C9,\"\")","v":""},null,null,null,null,"Notes on completing the tables\nThe table structure has been locked to prevent modification - data can be copied and pasted, in bulk into the Reporting Results blue table cells.  Where a white row exists between rows, it will not be possible to paste over white rows and sections should be pasted separately.\n\nColumn H in the Test Methods and Analysis table is set to automatically check whether the numerical values entered in the Reporting Results table exceed maximum or minimum Tolerance Limits.  If any exceedance is detected, please provide details in the columns to the right including the number of samples, location samples were taken from, Values and Details of any action taken to address non-compliant samples.  Compliance information is verified manually and this automated compliance check is not solely relied upon during data analysis.\n\nPlease do not unlock this template - modified templates cannot be processed and may delay reporting."]
["Reporting year",{"$f":"'Contacts&Annual Summary'!C8","v":2023}]
["Period (Summer or Winter)","Summer"]
["Parent fuel grade","Diesel"]
["National fuel grade"]
["The maximum FAME content (% v/v)",0]
["Reporting Results"]
[]
["Parameter","Unit","Analytical and statistical results",null,null,null,null,null,null,null,null,"Limiting value (1)",null,null,null,"Test method"]
[null,null,null,null,null,null,null,null,null,null,null,"National Specifications",null,"According to Directive 2009/30/EC",null,"(more recent versions may also be used)"]
[null,null,"No Samples","Minimum","Maximum","Median","Mean","Standard deviation","No Samples outside 95% tolerance limit","25% of Sample Value","75% of Sample Value","Minimum","Maximum","Minimum","Maximum","Method","Date"]
["Cetane number","--",0,0,0,0,0,0,0,0,0,null,null,51,"--","EN-ISO 5165",1998]
["Density at 15 oC (2)","kg/m3",0,0,0,0,0,0,0,0,0,null,null,null,845,"EN-ISO 3675",1998]
["Distillation -- 95-%-Point","oC",0,0,0,0,0,0,0,0,0,null,null,null,360,"EN-ISO 3405",2000]
["Polycyclic aromatic hydrocarbons (PAH) (3)","% (m/m)",0,0,0,0,0,0,0,0,0,null,null,null,8,"EN 12916",2006]
["Sulphur content","mg/kg",0,0,0,0,0,0,0,0,0,null,null,null,10,"EN ISO 20846\nEN ISO 20884",2004]
["FAME Content","% v/v",0,0,0,0,0,0,0,0,0,null,null,null,"7 (4)","EN 14078",2009]
[]
[]
["Sampling Frequency"]
[]
["Number of samples in month"]
["January",0,"July",0,"(1) The limiting values are \"true values\" and were established according to the procedures for limit setting in EN 228:2008.  The results of individual measurements shall be interpreted following the criteria described in EN 228:2008."]
["February",0,"August",0]
["March",0,"September",0,"(2) In cases of dispute EN ISO 3675: 1998 shall be used"]
["April",0,"October",0,"(3) Polycyclic aromatic hydrocarbons are defined as the total aromatic hydrocarbon content less than the mono-aromatic hydrocarbons content, both as determined by EN 12916"]
["May",0,"November",0]
["June",0,"December",0,"(4) FAME shall comply with EN 14078"]
[null,null,"Summer Months Total",{"$f":"SUM(B25:B30,D25:D30)","v":0},"(5) Only for countries which are measuring MMT in Diesel"]
[]
["Other notes (optional):"]
[]
[]
[]
["Test Methods and Analysis"]
[]
["Parameter","Unit","Test specified in 98/70/EC or EN590: 590 (more recent versions may also be used)",null,null,null,null,null,null,"Notes on exceedences"]
[null,null,"Method","Date","Reproducability, R","Tolerance limits",null,null,null,"Sample location \n(S,T or R)","Values","Details/action taken"]
[null,null,null,null,null,"Minimum","Maximum","Exceeded?"]
[{"$f":"'Methods&Limits'!A81","v":"Cetane number"},{"$f":"'Methods&Limits'!B81","v":"--"},{"$f":"'Methods&Limits'!E81","v":"EN-ISO 5165"},{"$f":"'Methods&Limits'!F81","v":2020},{"$f":"'Methods&Limits'!G81","v":4.3},{"$f":"'Methods&Limits'!H81","v":48.463000000000001},null,{"$f":"IF(D14=\"\",\"\",IF(D14<F42,\"Yes\",\"\"))","v":"Yes"}]
[{"$f":"'Methods&Limits'!A82","v":"Density at 15 oC"},{"$f":"'Methods&Limits'!B82","v":"kg/m3"},{"$f":"'Methods&Limits'!E82","v":"EN-ISO 3675"},{"$f":"'Methods&Limits'!F82","v":2022},{"$f":"'Methods&Limits'!G82","v":1.2},{"$f":"'Methods&Limits'!H82","v":0},{"$f":"'Methods&Limits'!I82","v":845.70799999999997},{"$f":"IF(E15=\"\",\"\",IF(E15>G43,\"Yes\",\"\"))","v":""}]
[null,null,{"$f":"'Methods&Limits'!E83","v":"EN-ISO 12185"},{"$f":"'Methods&Limits'!F83","v":2024},{"$f":"'Methods&Limits'!G83","v":0.50847457627110937},{"$f":"'Methods&Limits'!H83","v":0},{"$f":"'Methods&Limits'!I83","v":845.3},{"$f":"IF(E15=\"\",\"\",IF(E15>G44,\"Yes\",\"\"))","v":""}]
[{"$f":"'Methods&Limits'!A84","v":"Distillation -- 95% Point"},{"$f":"'Methods&Limits'!B84","v":"oC"},{"$f":"'Methods&Limits'!E84","v":"EN-ISO 3405"},{"$f":"'Methods&Limits'!F84","v":2019},{"$f":"'Methods&Limits'!G84","v":10},{"$f":"'Methods&Limits'!H84","v":0},{"$f":"'Methods&Limits'!I84","v":365.9},{"$f":"IF(E16=\"\",\"\",IF(E16>G45,\"Yes\",\"\"))","v":""}]
[{"$f":"'Methods&Limits'!A85","v":"Polycyclic aromatic hydrocarbons"},{"$f":"'Methods&Limits'!B85","v":"% (m/m)"},{"$f":"'Methods&Limits'!E85","v":"EN 12916"},{"$f":"'Methods&Limits'!F85","v":2019},{"$f":"'Methods&Limits'!G85","v":1.9},{"$f":"'Methods&Limits'!H85","v":0},{"$f":"'Methods&Limits'!I85","v":9.1210000000000004},{"$f":"IF(E17=\"\",\"\",IF(E17>G46,\"Yes\",\"\"))","v":""}]
[{"$f":"'Methods&Limits'!A86","v":"Sulphur content (sulphur free, from 2005)"},{"$f":"'Methods&Limits'!B86","v":"mg/kg"},{"$f":"'Methods&Limits'!E86","v":"EN-ISO 20846"},{"$f":"'Methods&Limits'!F86","v":2019},{"$f":"'Methods&Limits'!G86","v":2.2000000000000002},{"$f":"'Methods&Limits'!H86","v":0},{"$f":"'Methods&Limits'!I86","v":11.298},{"$f":"IF(E18=\"\",\"\",IF(E18>G47,\"Yes\",\"\"))","v":""}]
[null,null,{"$f":"'Methods&Limits'!E87","v":"EN-ISO 20884"},{"$f":"'Methods&Limits'!F87","v":2019},{"$f":"'Methods&Limits'!G87","v":3.1},{"$f":"'Methods&Limits'!H87","v":0},{"$f":"'Methods&Limits'!I87","v":11.829000000000001},{"$f":"IF(E18=\"\",\"\",IF(E18>G48,\"Yes\",\"\"))","v":""}]
[{"$f":"'Methods&Limits'!A88","v":"FAME Content"},{"$f":"'Methods&Limits'!B88","v":"% V/V"},{"$f":"'Methods&Limits'!E88","v":"EN14078"},{"$f":"'Methods&Limits'!F88","v":2014},{"$f":"'Methods&Limits'!G88","v":0.5},{"$f":"'Methods&Limits'!H88","v":0},{"$f":"'Methods&Limits'!I88","v":10.295},{"$f":"IF(E19=\"\",\"\",IF(E19>G49,\"Yes\",\"\"))","v":""}]

{"sheet":"Diesel (10)","index":41,"n_rows":49,"n_cols":18,"rows_kept":49,"cut":false,"hidden":false,"merged":[[2,1,2,3],[2,6,9,16],[3,1,3,3],[4,1,4,3],[5,1,5,3],[6,1,6,3],[7,1,7,3],[30,4,30,13],[10,2,11,10],[10,11,10,14],[10,15,10,16],[11,11,11,12],[11,13,11,14],[11,15,11,16],[23,0,23,3],[24,4,25,13],[26,4,26,13],[27,4,28,13],[29,4,29,13],[46,11,46,12],[33,0,33,13],[38,2,38,8],[38,9,38,12],[39,5,39,6],[39,8,40,8],[39,9,40,9],[39,10,40,10],[39,11,40,12],[41,11,41,12],[42,11,42,12],[43,11,43,12],[44,11,44,12],[45,11,45,12],[47,11,47,12],[48,11,48,12],[49,0,50,0],[49,1,50,1],[50,11,50,12],[49,11,49,12]]}
["Market Fuels used in the Compression Ignition Engines (Diesel)",null,null,null,null,null,null,null,null,null,null,null,null,null,null,null,null,"<-- GO BACK"]
[]
["Country",{"$f":"IF(LEN('Contacts&Annual Summary'!C9) > 1,'Contacts&Annual Summary'!C9,\"\")","v":""},null,null,null,null,"Notes on completing the tables\nThe table structure has been locked to prevent modification - data can be copied and pasted, in bulk into the Reporting Results blue table cells.  Where a white row exists between rows, it will not be possible to paste over white rows and sections should be pasted separately.\n\nColumn H in the Test Methods and Analysis table is set to automatically check whether the numerical values entered in the Reporting Results table exceed maximum or minimum Tolerance Limits.  If any exceedance is detected, please provide details in the columns to the right including the number of samples, location samples were taken from, Values and Details of any action taken to address non-compliant samples.  Compliance information is verified manually and this automated compliance check is not solely relied upon during data analysis.\n\nPlease do not unlock this template - modified templates cannot be processed and may delay reporting."]
["Reporting year",{"$f":"'Contacts&Annual Summary'!C8","v":2023}]
["Period (Summer or Winter)","Winter"]
["Parent fuel grade","Diesel"]
["National fuel grade",{"$f":"'Diesel (9)'!B7","v":0}]
["The maximum FAME content (% v/v)",0]
["Reporting Results"]
[]
["Parameter","Unit","Analytical and statistical results",null,null,null,null,null,null,null,null,"Limiting value (1)",null,null,null,"Test method"]
[null,null,null,null,null,null,null,null,null,null,null,"National Specifications",null,"According to Directive 2009/30/EC",null,"(more recent versions may also be used)"]
[null,null,"No Samples","Minimum","Maximum","Median","Mean","Standard deviation","No Samples outside 95% tolerance limit","25% of Sample Value","75% of Sample Value","Minimum","Maximum","Minimum","Maximum","Method","Date"]
["Cetane number","--",0,0,0,0,0,0,0,0,0,null,null,51,"--","EN-ISO 5165",1998]
["Density at 15 oC (2)","kg/m3",0,0,0,0,0,0,0,0,0,null,null,null,845,"EN-ISO 3675",1998]
["Distillation -- 95-%-Point","oC",0,0,0,0,0,0,0,0,0,null,null,null,360,"EN-ISO 3405",2000]
["Polycyclic aromatic hydrocarbons (PAH) (3)","% (m/m)",0,0,0,0,0,0,0,0,0,null,null,null,8,"EN 12916",2006]
["Sulphur content","mg/kg",0,0,0,0,0,0,0,0,0,null,null,null,10,"EN ISO 20846\nEN ISO 20884",2004]
["FAME Content","% v/v",0,0,0,0,0,0,0,0,0,null,null,null,"7 (4)","EN 14078",2009]
[]
[]
["Sampling Frequency"]
[]
["Number of samples in month"]
["January",0,"July",0,"(1) The limiting values are \"true values\" and were established according to the procedures for limit setting in EN 228:2008.  The results of individual measurements shall be interpreted following the criteria described in EN 228:2008."]
["February",0,"August",0]
["March",0,"September",0,"(2) In cases of dispute EN ISO 3675: 1998 shall be used"]
["April",0,"October",0,"(3) Polycyclic aromatic hydrocarbons are defined as the total aromatic hydrocarbon content less than the mono-aromatic hydrocarbons content, both as determined by EN 12916"]
["May",0,"November",0]
["June",0,"December",0,"(4) FAME shall comply with EN 14078"]
[null,null,"Winter Months Total",{"$f":"SUM(B25:B30,D25:D30)","v":0},"(5) Only for countries which are measuring MMT in Diesel"]
[]
["Other notes (optional):"]
[]
[]
[]
["Test Methods and Analysis"]
[]
["Parameter","Unit","Test specified in 98/70/EC or EN590: 590 (more recent versions may also be used)",null,null,null,null,null,null,"Notes on exceedences"]
[null,null,"Method","Date","Reproducability, R","Tolerance limits",null,null,null,"Sample location \n(S,T or R)","Values","Details/action taken"]
[null,null,null,null,null,"Minimum","Maximum","Exceeded?"]
[{"$f":"'Methods&Limits'!A81","v":"Cetane number"},{"$f":"'Methods&Limits'!B81","v":"--"},{"$f":"'Methods&Limits'!E81","v":"EN-ISO 5165"},{"$f":"'Methods&Limits'!F81","v":2020},{"$f":"'Methods&Limits'!G81","v":4.3},{"$f":"'Methods&Limits'!H81","v":48.463000000000001},null,{"$f":"IF(D14=\"\",\"\",IF(D14<F42,\"Yes\",\"\"))","v":"Yes"}]
[{"$f":"'Methods&Limits'!A82","v":"Density at 15 oC"},{"$f":"'Methods&Limits'!B82","v":"kg/m3"},{"$f":"'Methods&Limits'!E82","v":"EN-ISO 3675"},{"$f":"'Methods&Limits'!F82","v":2022},{"$f":"'Methods&Limits'!G82","v":1.2},{"$f":"'Methods&Limits'!H82","v":0},{"$f":"'Methods&Limits'!I82","v":845.70799999999997},{"$f":"IF(E15=\"\",\"\",IF(E15>G43,\"Yes\",\"\"))","v":""}]
[null,null,{"$f":"'Methods&Limits'!E83","v":"EN-ISO 12185"},{"$f":"'Methods&Limits'!F83","v":2024},{"$f":"'Methods&Limits'!G83","v":0.50847457627110937},{"$f":"'Methods&Limits'!H83","v":0},{"$f":"'Methods&Limits'!I83","v":845.3},{"$f":"IF(E15=\"\",\"\",IF(E15>G44,\"Yes\",\"\"))","v":""}]
[{"$f":"'Methods&Limits'!A84","v":"Distillation -- 95% Point"},{"$f":"'Methods&Limits'!B84","v":"oC"},{"$f":"'Methods&Limits'!E84","v":"EN-ISO 3405"},{"$f":"'Methods&Limits'!F84","v":2019},{"$f":"'Methods&Limits'!G84","v":10},{"$f":"'Methods&Limits'!H84","v":0},{"$f":"'Methods&Limits'!I84","v":365.9},{"$f":"IF(E16=\"\",\"\",IF(E16>G45,\"Yes\",\"\"))","v":""}]
[{"$f":"'Methods&Limits'!A85","v":"Polycyclic aromatic hydrocarbons"},{"$f":"'Methods&Limits'!B85","v":"% (m/m)"},{"$f":"'Methods&Limits'!E85","v":"EN 12916"},{"$f":"'Methods&Limits'!F85","v":2019},{"$f":"'Methods&Limits'!G85","v":1.9},{"$f":"'Methods&Limits'!H85","v":0},{"$f":"'Methods&Limits'!I85","v":9.1210000000000004},{"$f":"IF(E17=\"\",\"\",IF(E17>G46,\"Yes\",\"\"))","v":""}]
[{"$f":"'Methods&Limits'!A86","v":"Sulphur content (sulphur free, from 2005)"},{"$f":"'Methods&Limits'!B86","v":"mg/kg"},{"$f":"'Methods&Limits'!E86","v":"EN-ISO 20846"},{"$f":"'Methods&Limits'!F86","v":2019},{"$f":"'Methods&Limits'!G86","v":2.2000000000000002},{"$f":"'Methods&Limits'!H86","v":0},{"$f":"'Methods&Limits'!I86","v":11.298},{"$f":"IF(E18=\"\",\"\",IF(E18>G47,\"Yes\",\"\"))","v":""}]
[null,null,{"$f":"'Methods&Limits'!E87","v":"EN-ISO 20884"},{"$f":"'Methods&Limits'!F87","v":2019},{"$f":"'Methods&Limits'!G87","v":3.1},{"$f":"'Methods&Limits'!H87","v":0},{"$f":"'Methods&Limits'!I87","v":11.829000000000001},{"$f":"IF(E18=\"\",\"\",IF(E18>G48,\"Yes\",\"\"))","v":""}]
[{"$f":"'Methods&Limits'!A88","v":"FAME Content"},{"$f":"'Methods&Limits'!B88","v":"% V/V"},{"$f":"'Methods&Limits'!E88","v":"EN14078"},{"$f":"'Methods&Limits'!F88","v":2014},{"$f":"'Methods&Limits'!G88","v":0.5},{"$f":"'Methods&Limits'!H88","v":0},{"$f":"'Methods&Limits'!I88","v":10.295},{"$f":"IF(E19=\"\",\"\",IF(E19>G49,\"Yes\",\"\"))","v":""}]

{"sheet":"Diesel (9+10)","index":42,"n_rows":49,"n_cols":18,"rows_kept":49,"cut":false,"hidden":false,"merged":[[2,1,2,3],[2,6,9,16],[3,1,3,3],[4,1,4,3],[5,1,5,3],[6,1,6,3],[7,1,7,3],[30,4,30,13],[10,2,11,10],[10,11,10,14],[10,15,10,16],[11,11,11,12],[11,13,11,14],[11,15,11,16],[23,0,23,3],[24,4,25,13],[26,4,26,13],[27,4,28,13],[29,4,29,13],[46,11,46,12],[33,0,33,13],[38,2,38,8],[38,9,38,12],[39,5,39,6],[39,8,40,8],[39,9,40,9],[39,10,40,10],[39,11,40,12],[41,11,41,12],[42,11,42,12],[43,11,43,12],[44,11,44,12],[45,11,45,12],[47,11,47,12],[48,11,48,12],[49,0,50,0],[49,1,50,1],[50,11,50,12],[49,11,49,12]]}
["Market Fuels used in the Compression Ignition Engines (Diesel)",null,null,null,null,null,null,null,null,null,null,null,null,null,null,null,null,"<-- GO BACK"]
[]
["Country",{"$f":"IF(LEN('Contacts&Annual Summary'!C9) > 1,'Contacts&Annual Summary'!C9,\"\")","v":""},null,null,null,null,"Notes on completing the tables\nThe table structure has been locked to prevent modification - data can be copied and pasted, in bulk into the Reporting Results blue table cells.  Where a white row exists between rows, it will not be possible to paste over white rows and sections should be pasted separately.\n\nColumn H in the Test Methods and Analysis table is set to automatically check whether the numerical values entered in the Reporting Results table exceed maximum or minimum Tolerance Limits.  If any exceedance is detected, please provide details in the columns to the right including the number of samples, location samples were taken from, Values and Details of any action taken to address non-compliant samples.  Compliance information is verified manually and this automated compliance check is not solely relied upon during data analysis.\n\nPlease do not unlock this template - modified templates cannot be processed and may delay reporting."]
["Reporting year",{"$f":"'Contacts&Annual Summary'!C8","v":2023}]
["Period (Summer or Winter)","Full Year"]
["Parent fuel grade","Diesel"]
["National fuel grade",{"$f":"'Diesel (9)'!B7","v":0}]
["The maximum FAME content (% v/v)",{"$f":"MAX('Diesel (9)'!B8:D8,'Diesel (10)'!B8:D8)","v":0}]
["Reporting Results"]
[]
["Parameter","Unit","Analytical and statistical results",null,null,null,null,null,null,null,null,"Limiting value (1)",null,null,null,"Test method"]
[null,null,null,null,null,null,null,null,null,null,null,"National Specifications",null,"According to Directive 2009/30/EC",null,"(more recent versions may also be used)"]
[null,null,"No Samples","Minimum","Maximum","Median","Mean","Standard deviation","No Samples outside 95% tolerance limit","25% of Sample Value","75% of Sample Value","Minimum","Maximum","Minimum","Maximum","Method","Date"]
["Cetane number","--",{"$f":"IF(AND('Diesel (9)'!C14=\"\",'Diesel (10)'!C14=\"\"),\"\",SUM('Diesel (9)'!C14,'Diesel (10)'!C14))","v":0},{"$f":"IF(AND('Diesel (9)'!D14=\"\",'Diesel (10)'!D14=\"\"),\"\",MIN('Diesel (9)'!D14,'Diesel (10)'!D14))","v":0},{"$f":"IF(AND('Diesel (9)'!E14=\"\",'Diesel (10)'!E14=\"\"),\"\",MAX('Diesel (9)'!E14,'Diesel (10)'!E14))","v":0},0,0,0,{"$f":"IF(AND('Diesel (9)'!I14=\"\",'Diesel (10)'!I14=\"\"),\"\",SUM('Diesel (9)'!I14,'Diesel (10)'!I14))","v":0},0,0,null,null,51,"--","EN-ISO 5165",1998]
["Density at 15 oC (2)","kg/m3",{"$f":"IF(AND('Diesel (9)'!C15=\"\",'Diesel (10)'!C15=\"\"),\"\",SUM('Diesel (9)'!C15,'Diesel (10)'!C15))","v":0},{"$f":"IF(AND('Diesel (9)'!D15=\"\",'Diesel (10)'!D15=\"\"),\"\",MIN('Diesel (9)'!D15,'Diesel (10)'!D15))","v":0},{"$f":"IF(AND('Diesel (9)'!E15=\"\",'Diesel (10)'!E15=\"\"),\"\",MAX('Diesel (9)'!E15,'Diesel (10)'!E15))","v":0},0,0,0,{"$f":"IF(AND('Diesel (9)'!I15=\"\",'Diesel (10)'!I15=\"\"),\"\",SUM('Diesel (9)'!I15,'Diesel (10)'!I15))","v":0},0,0,null,null,null,845,"EN-ISO 3675",1998]
["Distillation -- 95-%-Point","oC",{"$f":"IF(AND('Diesel (9)'!C16=\"\",'Diesel (10)'!C16=\"\"),\"\",SUM('Diesel (9)'!C16,'Diesel (10)'!C16))","v":0},{"$f":"IF(AND('Diesel (9)'!D16=\"\",'Diesel (10)'!D16=\"\"),\"\",MIN('Diesel (9)'!D16,'Diesel (10)'!D16))","v":0},{"$f":"IF(AND('Diesel (9)'!E16=\"\",'Diesel (10)'!E16=\"\"),\"\",MAX('Diesel (9)'!E16,'Diesel (10)'!E16))","v":0},0,0,0,{"$f":"IF(AND('Diesel (9)'!I16=\"\",'Diesel (10)'!I16=\"\"),\"\",SUM('Diesel (9)'!I16,'Diesel (10)'!I16))","v":0},0,0,null,null,null,360,"EN-ISO 3405",2000]
["Polycyclic aromatic hydrocarbons (PAH) (3)","% (m/m)",{"$f":"IF(AND('Diesel (9)'!C17=\"\",'Diesel (10)'!C17=\"\"),\"\",SUM('Diesel (9)'!C17,'Diesel (10)'!C17))","v":0},{"$f":"IF(AND('Diesel (9)'!D17=\"\",'Diesel (10)'!D17=\"\"),\"\",MIN('Diesel (9)'!D17,'Diesel (10)'!D17))","v":0},{"$f":"IF(AND('Diesel (9)'!E17=\"\",'Diesel (10)'!E17=\"\"),\"\",MAX('Diesel (9)'!E17,'Diesel (10)'!E17))","v":0},0,0,0,{"$f":"IF(AND('Diesel (9)'!I17=\"\",'Diesel (10)'!I17=\"\"),\"\",SUM('Diesel (9)'!I17,'Diesel (10)'!I17))","v":0},0,0,null,null,null,8,"EN 12916",2006]
["Sulphur content","mg/kg",{"$f":"IF(AND('Diesel (9)'!C18=\"\",'Diesel (10)'!C18=\"\"),\"\",SUM('Diesel (9)'!C18,'Diesel (10)'!C18))","v":0},{"$f":"IF(AND('Diesel (9)'!D18=\"\",'Diesel (10)'!D18=\"\"),\"\",MIN('Diesel (9)'!D18,'Diesel (10)'!D18))","v":0},{"$f":"IF(AND('Diesel (9)'!E18=\"\",'Diesel (10)'!E18=\"\"),\"\",MAX('Diesel (9)'!E18,'Diesel (10)'!E18))","v":0},0,0,0,{"$f":"IF(AND('Diesel (9)'!I18=\"\",'Diesel (10)'!I18=\"\"),\"\",SUM('Diesel (9)'!I18,'Diesel (10)'!I18))","v":0},0,0,null,null,null,10,"EN ISO 20846\nEN ISO 20884",2004]
["FAME Content","% v/v",{"$f":"IF(AND('Diesel (9)'!C19=\"\",'Diesel (10)'!C19=\"\"),\"\",SUM('Diesel (9)'!C19,'Diesel (10)'!C19))","v":0},{"$f":"IF(AND('Diesel (9)'!D19=\"\",'Diesel (10)'!D19=\"\"),\"\",MIN('Diesel (9)'!D19,'Diesel (10)'!D19))","v":0},{"$f":"IF(AND('Diesel (9)'!E19=\"\",'Diesel (10)'!E19=\"\"),\"\",MAX('Diesel (9)'!E19,'Diesel (10)'!E19))","v":0},0,0,0,{"$f":"IF(AND('Diesel (9)'!I19=\"\",'Diesel (10)'!I19=\"\"),\"\",SUM('Diesel (9)'!I19,'Diesel (10)'!I19))","v":0},0,0,null,null,null,"7 (4)","EN 14078",2009]
[]
[]
["Sampling Frequency"]
[]
["Number of samples in month"]
["January",{"$f":"'Diesel (9)'!B25+'Diesel (10)'!B25","v":0},"July",{"$f":"'Diesel (9)'!D25+'Diesel (10)'!D25","v":0},"(1) The limiting values are \"true values\" and were established according to the procedures for limit setting in EN 228:2008.  The results of individual measurements shall be interpreted following the criteria described in EN 228:2008."]
["February",{"$f":"'Diesel (9)'!B26+'Diesel (10)'!B26","v":0},"August",{"$f":"'Diesel (9)'!D26+'Diesel (10)'!D26","v":0}]
["March",{"$f":"'Diesel (9)'!B27+'Diesel (10)'!B27","v":0},"September",{"$f":"'Diesel (9)'!D27+'Diesel (10)'!D27","v":0},"(2) In cases of dispute EN ISO 3675: 1998 shall be used"]
["April",{"$f":"'Diesel (9)'!B28+'Diesel (10)'!B28","v":0},"October",{"$f":"'Diesel (9)'!D28+'Diesel (10)'!D28","v":0},"(3) Polycyclic aromatic hydrocarbons are defined as the total aromatic hydrocarbon content less than the mono-aromatic hydrocarbons content, both as determined by EN 12916"]
["May",{"$f":"'Diesel (9)'!B29+'Diesel (10)'!B29","v":0},"November",{"$f":"'Diesel (9)'!D29+'Diesel (10)'!D29","v":0}]
["June",{"$f":"'Diesel (9)'!B30+'Diesel (10)'!B30","v":0},"December",{"$f":"'Diesel (9)'!D30+'Diesel (10)'!D30","v":0},"(4) FAME shall comply with EN 14078"]
[null,null,"Full Year Total",{"$f":"SUM(B25:B30,D25:D30)","v":0},"(5) Only for countries which are measuring MMT in Diesel"]
[]
["Other notes (optional):"]
[]
[]
[]
["Test Methods and Analysis",null,null,null,null,null,null,null,null,"Only if not provided in Summer and Winter sheets"]
[]
["Parameter","Unit","Test specified in 98/70/EC or EN590: 590 (more recent versions may also be used)",null,null,null,null,null,null,"Notes on exceedences"]
[null,null,"Method","Date","Reproducability, R","Tolerance limits",null,null,null,"Sample location \n(S,T or R)","Values","Details/action taken"]
[null,null,null,null,null,"Minimum","Maximum","Exceeded?"]
[{"$f":"'Methods&Limits'!A81","v":"Cetane number"},{"$f":"'Methods&Limits'!B81","v":"--"},{"$f":"'Methods&Limits'!E81","v":"EN-ISO 5165"},{"$f":"'Methods&Limits'!F81","v":2020},{"$f":"'Methods&Limits'!G81","v":4.3},{"$f":"'Methods&Limits'!H81","v":48.463000000000001},null,{"$f":"IF(D14=\"\",\"\",IF(D14<F42,\"Yes\",\"\"))","v":"Yes"}]
[{"$f":"'Methods&Limits'!A82","v":"Density at 15 oC"},{"$f":"'Methods&Limits'!B82","v":"kg/m3"},{"$f":"'Methods&Limits'!E82","v":"EN-ISO 3675"},{"$f":"'Methods&Limits'!F82","v":2022},{"$f":"'Methods&Limits'!G82","v":1.2},{"$f":"'Methods&Limits'!H82","v":0},{"$f":"'Methods&Limits'!I82","v":845.70799999999997},{"$f":"IF(E15=\"\",\"\",IF(E15>G43,\"Yes\",\"\"))","v":""}]
[null,null,{"$f":"'Methods&Limits'!E83","v":"EN-ISO 12185"},{"$f":"'Methods&Limits'!F83","v":2024},{"$f":"'Methods&Limits'!G83","v":0.50847457627110937},{"$f":"'Methods&Limits'!H83","v":0},{"$f":"'Methods&Limits'!I83","v":845.3},{"$f":"IF(E15=\"\",\"\",IF(E15>G44,\"Yes\",\"\"))","v":""}]
[{"$f":"'Methods&Limits'!A84","v":"Distillation -- 95% Point"},{"$f":"'Methods&Limits'!B84","v":"oC"},{"$f":"'Methods&Limits'!E84","v":"EN-ISO 3405"},{"$f":"'Methods&Limits'!F84","v":2019},{"$f":"'Methods&Limits'!G84","v":10},{"$f":"'Methods&Limits'!H84","v":0},{"$f":"'Methods&Limits'!I84","v":365.9},{"$f":"IF(E16=\"\",\"\",IF(E16>G45,\"Yes\",\"\"))","v":""}]
[{"$f":"'Methods&Limits'!A85","v":"Polycyclic aromatic hydrocarbons"},{"$f":"'Methods&Limits'!B85","v":"% (m/m)"},{"$f":"'Methods&Limits'!E85","v":"EN 12916"},{"$f":"'Methods&Limits'!F85","v":2019},{"$f":"'Methods&Limits'!G85","v":1.9},{"$f":"'Methods&Limits'!H85","v":0},{"$f":"'Methods&Limits'!I85","v":9.1210000000000004},{"$f":"IF(E17=\"\",\"\",IF(E17>G46,\"Yes\",\"\"))","v":""}]
[{"$f":"'Methods&Limits'!A86","v":"Sulphur content (sulphur free, from 2005)"},{"$f":"'Methods&Limits'!B86","v":"mg/kg"},{"$f":"'Methods&Limits'!E86","v":"EN-ISO 20846"},{"$f":"'Methods&Limits'!F86","v":2019},{"$f":"'Methods&Limits'!G86","v":2.2000000000000002},{"$f":"'Methods&Limits'!H86","v":0},{"$f":"'Methods&Limits'!I86","v":11.298},{"$f":"IF(E18=\"\",\"\",IF(E18>G47,\"Yes\",\"\"))","v":""}]
[null,null,{"$f":"'Methods&Limits'!E87","v":"EN-ISO 20884"},{"$f":"'Methods&Limits'!F87","v":2019},{"$f":"'Methods&Limits'!G87","v":3.1},{"$f":"'Methods&Limits'!H87","v":0},{"$f":"'Methods&Limits'!I87","v":11.829000000000001},{"$f":"IF(E18=\"\",\"\",IF(E18>G48,\"Yes\",\"\"))","v":""}]
[{"$f":"'Methods&Limits'!A88","v":"FAME Content"},{"$f":"'Methods&Limits'!B88","v":"% V/V"},{"$f":"'Methods&Limits'!E88","v":"EN14078"},{"$f":"'Methods&Limits'!F88","v":2014},{"$f":"'Methods&Limits'!G88","v":0.5},{"$f":"'Methods&Limits'!H88","v":0},{"$f":"'Methods&Limits'!I88","v":10.295},{"$f":"IF(E19=\"\",\"\",IF(E19>G49,\"Yes\",\"\"))","v":""}]